program: Gaussian 16
title: Scaling factors
version: ES64L-G16RevC.01
frameworkgroup: C*V[C*(NNO)]
method: RPBE1PBE
basis: 6-311++G(2d,2p)
operation: Freq
keyword: #N
keyword: Geom=AllCheck
keyword: Guess=TCheck
keyword: SCRF=Check
keyword: GenChk
keyword: RPBE1PBE/6-311++G(2d,2p)
keyword: Freq
converged: YES YES YES YES
title: Mulliken charges:
elementType: N N O
charge: -0.129577 0.355826 -0.226249
chargesum: -0.00000
title: Mulliken charges with hydrogens summed into heavy atoms:
1716.lowfreq: -0.0016 -0.0016 -0.0012 10.3974 10.3974 633.3036 633.3036 1363.1025 2383.0635
frequency: 633.3035 633.3035 1363.1025 2383.0635
redmass: 14.2537 14.2537 15.1054 14.0916
irintensity: 5.2578 5.2578 70.4883 412.4306
temp: 298.150 k
press: 1.00000 atm
elementType: 7 7 8
symmnumber: 1
zpe: 29983.0 jmol-1
zpe.correction: 0.011420 hartree
zpe.thermalcorrener: 0.014074 hartree
zpe.thermalcorrenthalpy: 0.015018 hartree
zpe.thermalcorrgfe: -0.009861 hartree
zpe.sumelectzpe: -184.514043 hartree
zpe.sumelectthermal: -184.511389 hartree
zpe.sumelectthermalent: -184.510444 hartree
zpe.sumelectthermalfe: -184.535324 hartree
dipole: 0.0000 0.0000 -0.0586
dipole: 0.0586
quadrupole: -15.2891 -15.2891 -19.0603
quadrupole: 0.0000 0.0000 0.0000
quadrupole: 1.2571 1.2571 -2.5141 0.0000 0.0000 0.0000
hfenergy: -184.5254628 hartree
pointgroup: C*V [C*(N1N1O1)]
dipole: 0. 0. -0.0230571 debye
dipolederiv: -0.111092 0. 0. 0. -0.111092 0. 0. 0. -0.7472198 0.2269127 0. 0. 0. 0.2269127 0. 0. 0. 2.1548797 -0.1158208 0. 0. 0. -0.1158208 0. 0. 0. -1.40766 unknown
polarizability: 10.6496455|0.|10.6496455|0.|0.|31.3345796 unknown
InChI: InChI=1S/N2O/c1-2-3
charge 0 multiplicity 1
3 atoms
N  0.0000 0.0000 -1.19845729
N  0.0000 0.0000 -0.07962349
O  0.0000 0.0000 1.09890778
