program: Gaussian 16
title: Scaling factors
version: ES64L-G16RevC.01
frameworkgroup: D*H[C*(F.F)]
method: RPBE1PBE
basis: 6-311++G(2d,2p)
operation: Freq
keyword: #N
keyword: Geom=AllCheck
keyword: Guess=TCheck
keyword: SCRF=Check
keyword: GenChk
keyword: RPBE1PBE/6-311++G(2d,2p)
keyword: Freq
converged: YES YES YES YES
title: Mulliken charges:
elementType: F F
charge: -0.000000 -0.000000
chargesum: -0.00000
title: Mulliken charges with hydrogens summed into heavy atoms:
chargesum: 0.00000
1716.lowfreq: -4.2174 -4.2174 -0.0012 -0.0012 -0.0002 1081.8118
frequency: 1081.8118
redmass: 18.9984
irintensity: 0.0000
temp: 298.150 k
press: 1.00000 atm
elementType: 9 9
symmnumber: 2
zpe: 6470.7 jmol-1
zpe.correction: 0.002465 hartree
zpe.thermalcorrener: 0.004852 hartree
zpe.thermalcorrenthalpy: 0.005796 hartree
zpe.thermalcorrgfe: -0.017127 hartree
zpe.sumelectzpe: -199.383301 hartree
zpe.sumelectthermal: -199.380914 hartree
zpe.sumelectthermalent: -199.379970 hartree
zpe.sumelectthermalfe: -199.402893 hartree
dipole: -0.0000 -0.0000 -0.0000
dipole: 0.0000
quadrupole: -9.6926 -9.6926 -8.8799
quadrupole: 0.0000 0.0000 0.0000
quadrupole: -0.2709 -0.2709 0.5418 0.0000 0.0000 0.0000
hfenergy: -199.3857656 hartree
pointgroup: D*H [C*(F1.F1)]
dipole: 0. 0. 0. debye
dipolederiv: 0. 0. 0. 0. 0. 0. 0. 0. 0. 0. 0. 0. 0. 0. 0. 0. 0. 0. unknown
polarizability: 4.2113418|0.|4.2113418|0.|0.|10.9476052 unknown
InChI: InChI=1S/F2/c1-2
charge 0 multiplicity 1
2 atoms
F  0.0000 0.0000 0.68918912
F  0.0000 0.0000 -0.68918912
