program: Gaussian 16
title: Scaling factors
version: EM64L-G16RevC.01
frameworkgroup: C*V[C*(HO)]
method: UwB97XD
basis: 6-311++G(2d,2p)
operation: Freq
keyword: #N
keyword: Geom=AllCheck
keyword: Guess=TCheck
keyword: SCRF=Check
keyword: GenChk
keyword: UwB97XD/6-311++G(2d,2p)
keyword: Freq
converged: YES YES YES YES
elementType: H
1716.lowfreq: -59.0429 -0.0007 0.0007 0.0011 21.0742 3796.2905
frequency: 3796.2905
redmass: 1.0671
irintensity: 17.1761
temp: 298.150 k
press: 1.00000 atm
elementType: 1 8
symmnumber: 1
zpe: 22706.9 jmol-1
zpe.correction: 0.008649 hartree
zpe.thermalcorrener: 0.011009 hartree
zpe.thermalcorrenthalpy: 0.011953 hartree
zpe.thermalcorrgfe: -0.008268 hartree
zpe.sumelectzpe: -75.727618 hartree
zpe.sumelectthermal: -75.725258 hartree
zpe.sumelectthermalent: -75.724314 hartree
zpe.sumelectthermalfe: -75.744534 hartree
hfenergy: -75.7362669 hartree
pointgroup: C*V [C*(H1O1)]
dipole: 0. 0. -0.6819354 debye
dipolederiv: 0.3721562 0. 0. 0. 0.3722104 0. 0. 0. 0.129244 -0.3721562 0. 0. 0. -0.3722104 0. 0. 0. -0.129244 unknown
polarizability: 4.2638842|0.|5.5312326|0.|0.|7.5311162 unknown
InChI: InChI=1S/HO/h1H
charge 0 multiplicity 2
2 atoms
H  0.0000 0.0000 -0.86986745
O  0.0000 0.0000 0.09967845
