program: Gaussian 16
title: Scaling factors
version: ES64L-G16RevC.01
frameworkgroup: D*H[C*(F.F)]
method: RwB97XD
basis: 6-311++G(2d,2p)
operation: Freq
keyword: #N
keyword: Geom=AllCheck
keyword: Guess=TCheck
keyword: SCRF=Check
keyword: GenChk
keyword: RwB97XD/6-311++G(2d,2p)
keyword: Freq
converged: YES YES YES YES
title: Mulliken charges:
elementType: F F
charge: 0.000000 0.000000
chargesum: 0.00000
title: Mulliken charges with hydrogens summed into heavy atoms:
1716.lowfreq: -6.7135 -6.7135 -0.0025 -0.0011 0.0007 1076.3805
frequency: 1076.3805
redmass: 18.9984
irintensity: 0.0000
temp: 298.150 k
press: 1.00000 atm
elementType: 9 9
symmnumber: 2
zpe: 6438.2 jmol-1
zpe.correction: 0.002452 hartree
zpe.thermalcorrener: 0.004840 hartree
zpe.thermalcorrenthalpy: 0.005784 hartree
zpe.thermalcorrgfe: -0.017142 hartree
zpe.sumelectzpe: -199.515767 hartree
zpe.sumelectthermal: -199.513379 hartree
zpe.sumelectthermalent: -199.512435 hartree
zpe.sumelectthermalfe: -199.535361 hartree
dipole: -0.0000 -0.0000 0.0000
dipole: 0.0000
quadrupole: -9.6632 -9.6632 -8.8509
quadrupole: 0.0000 0.0000 0.0000
quadrupole: -0.2708 -0.2708 0.5415 0.0000 0.0000 0.0000
hfenergy: -199.5182193 hartree
pointgroup: D*H [C*(F1.F1)]
dipole: 0. 0. 0. debye
dipolederiv: 0. 0. 0. 0. 0. 0. 0. 0. 0. 0. 0. 0. 0. 0. 0. 0. 0. 0. unknown
polarizability: 4.1700447|0.|4.1700447|0.|0.|11.0336939 unknown
InChI: InChI=1S/F2/c1-2
charge 0 multiplicity 1
2 atoms
F  0.0000 0.0000 0.69003894
F  0.0000 0.0000 -0.69003894
