program: Gaussian 09
title: 000046800
version: EM64L-G09RevD.01
frameworkgroup: C1[X(C16H19N2O2)]
method: RPBEPBE
basis: SDD
operation: Freq
keyword: #p
keyword: freq=noraman
keyword: PBEPBE/SDD
title: #p freq=noraman PBEPBE/SDD
converged: NO YES NO NO
title: Mulliken charges:
elementType: O O N N C C C C C C C C C C C C C C C C H H H H H H H H H H H H H H H H H H H
charge: -0.313303 -0.272556 -0.235584 -0.665421 0.586671 -0.558200 -0.558964 -0.596635 -0.465698 -0.380712 0.361400 -0.213342 -0.398287 0.150544 0.239461 -0.314242 -0.307921 0.506378 -0.398477 -0.387468 0.281845 0.256379 0.271688 0.272004 0.256608 0.282105 0.283697 0.259337 0.284495 0.336415 0.243522 0.256657 0.281177 0.265713 0.260966 0.237355 0.234881 0.328458 0.329053
chargesum: 1.00000
title: Mulliken charges with hydrogens summed into heavy atoms:
elementType: O O N N C C C C C C C C C C C C C C C C
charge: -0.313303 -0.272556 -0.235584 -0.007910 0.586671 0.251712 0.251753 0.230893 -0.129283 -0.137189 0.361400 0.043315 -0.117111 0.150544 0.239461 -0.048529 -0.046955 0.506378 -0.161121 -0.152587
polarizability: 3.72395341e+02 -3.53662655e+00 1.92685563e+02 4.18388870e-01 9.88423789e-02 9.44805185e+01
1716.lowfreq: 0.0003 0.0004 0.0007 0.5157 8.0245 13.0330 20.4946 29.9980 49.4432
frequency: 19.9685 29.8870 49.4205 62.8301 89.8479 108.2620 128.5196 132.3458 193.0037 229.7925 233.2171 260.3677 274.5342 284.4245 306.3540 330.5774 342.9542 356.9755 368.2979 379.7069 409.4175 411.0463 436.2333 456.9985 465.6853 487.3422 493.6608 527.3501 543.0092 560.7128 618.7148 626.7782 633.1772 663.8724 679.4198 691.0466 752.2919 752.8493 789.5337 800.0216 822.4242 824.3803 847.2732 882.8320 901.5244 911.9743 933.7001 934.5330 963.3059 977.0275 984.6796 984.7631 989.6128 1001.5168 1025.1147 1044.5600 1085.2587 1103.5757 1106.0888 1118.5782 1140.8770 1174.5254 1186.3119 1206.2138 1215.0576 1224.2339 1251.6676 1261.7085 1307.7983 1314.2202 1346.5506 1383.8954 1394.3911 1419.2200 1421.6032 1442.9388 1452.1349 1454.5111 1462.4645 1464.2811 1469.5367 1477.9002 1481.6878 1489.1420 1503.5881 1519.8364 1557.8105 1575.4801 1614.7185 1630.2663 1639.7016 1656.5166 3029.1509 3030.9920 3035.2724 3136.7233 3138.9696 3144.0282 3144.8948 3147.6179 3150.9663 3158.0642 3163.1154 3164.4662 3164.7569 3169.0342 3184.0393 3186.8302 3205.3065 3547.6971 3684.6049
redmass: 5.5181 3.1963 3.9713 4.9398 7.0561 5.4672 5.2310 2.7993 1.0865 3.6857 4.9138 1.1662 3.6248 5.2854 4.1665 2.9852 1.0637 3.4833 4.5297 3.0723 2.5099 2.5649 4.2567 1.0805 3.1374 3.9533 1.8638 1.5741 3.0540 7.6418 4.8162 6.9318 6.8642 4.5585 6.3719 2.2190 4.2952 8.2834 1.4818 4.2224 5.3351 1.2683 1.8217 4.8209 1.4671 1.9044 2.4059 1.8557 7.8882 1.3577 1.3527 6.0866 1.3439 2.6713 1.4646 1.1929 1.6212 1.4633 1.3120 1.4830 1.2143 1.6786 1.1211 1.7293 1.8808 1.9488 2.0700 2.9104 1.3349 1.3350 2.8534 5.9814 3.9354 1.1373 1.1363 3.1735 1.0484 1.1910 1.3782 1.0659 4.8650 1.1063 1.3966 1.0455 1.0727 3.2276 6.6590 6.5402 7.5159 7.6429 3.0893 1.5149 1.0320 1.0322 1.0329 1.0897 1.0894 1.1052 1.1045 1.0910 1.1051 1.1050 1.1059 1.0966 1.1031 1.0933 1.0948 1.0987 1.0921 1.0458 1.1040
irintensity: 7.2965 0.4128 1.2773 5.5799 0.1551 0.1195 7.1110 1.1849 0.0101 0.0279 0.1651 0.9554 5.6577 4.2646 0.4956 1.4232 0.3282 0.8622 2.3364 5.7122 0.0275 0.0979 2.2284 0.5492 4.0073 2.7938 153.9787 163.4640 1.5686 18.7569 2.1396 33.0394 4.6244 19.9685 15.3089 35.9719 10.8354 72.1287 36.0353 12.5528 16.0559 1.2679 80.2077 36.9126 12.0236 1.4132 10.9888 30.0448 661.9867 0.0007 0.0467 14.7740 0.6646 79.8452 24.7931 0.0424 7.4642 29.7213 1.8225 1.4744 15.6296 477.1535 176.1648 105.4157 0.0422 28.8214 109.7625 82.2782 153.0484 2.8508 124.4671 45.6563 7.8075 23.4590 18.1680 18.5300 0.1107 50.0693 135.4216 13.2165 7.8450 122.4278 135.4165 33.6731 58.9040 73.4688 28.1403 48.7869 701.5790 419.4516 20.9285 230.8077 3.2575 5.5467 5.7866 6.7645 12.7698 0.6731 0.9646 6.1073 21.4521 0.2045 1.4572 8.1433 2.2314 6.0323 3.5067 0.4577 49.2085 218.5609 33.0298
temp: 298.150 k
press: 1.00000 atm
elementType: 8 8 7 7 6 6 6 6 6 6 6 6 6 6 6 6 6 6 6 6 1 1 1 1 1 1 1 1 1 1 1 1 1 1 1 1 1 1 1
symmnumber: 1
zpe: 844267.4 jmol-1
zpe.correction: 0.321564 hartree
zpe.thermalcorrener: 0.340515 hartree
zpe.thermalcorrenthalpy: 0.341459 hartree
zpe.thermalcorrgfe: 0.273688 hartree
zpe.sumelectzpe: -879.366377 hartree
zpe.sumelectthermal: -879.347426 hartree
zpe.sumelectthermalent: -879.346482 hartree
zpe.sumelectthermalfe: -879.414253 hartree
dipole: -8.9996 -1.1134 0.0812
dipole: 9.0686
quadrupole: 40.8827 -92.9552 -117.3104
quadrupole: 13.3412 0.0533 -0.0541
quadrupole: 97.3437 -36.4942 -60.8494 13.3412 0.0533 -0.0541
hfenergy: -879.687941 hartree
pointgroup: C01 [X(C16H19N2O2)]
dipole: 3.5301847 0.3954775 -0.3333116 debye
polarizability: 372.4063441|-2.1290486|154.3205343|-3.4338043|-47.8486848|132.8345442 unknown
InChI: InChI=1S/C16H19N2O2/c1-18(2,3)14-5-4-6-15(11-14)20-16(19)12-7-9-13(17)10-8-12/h4-11H,17H2,1-3H3
charge 1 multiplicity 1
39 atoms
O  -0.418368 -0.476012 0.580164
O  -0.497023 1.371324 -0.906303
N  4.302142 0.878098 -0.555554
N  -6.776736 0.136248 0.235817
C  3.274839 -0.008509 0.161892
C  5.186242 0.008512 -1.460241
C  5.171677 1.595832 0.486543
C  3.650761 1.9480 -1.43415
C  1.903596 0.237968 -0.021372
C  3.753921 -1.045633 0.990181
C  0.97316 -0.596744 0.656812
C  2.807936 -1.861876 1.651588
C  1.426801 -1.64625 1.491452
C  -1.119017 0.526607 -0.212134
C  -2.56127 0.385019 -0.06597
C  -3.398855 1.298734 -0.776799
C  -3.173636 -0.615368 0.747797
C  -5.40301 0.217183 0.136587
C  -4.788976 1.221705 -0.680955
C  -4.564577 -0.700835 0.848789
H  4.542953 -0.491434 -2.198981
H  5.922318 0.65448 -1.963618
H  5.702594 -0.745983 -0.852047
H  5.701568 0.852235 1.096711
H  5.89623 2.239195 -0.036938
H  4.515078 2.198986 1.130481
H  3.038884 2.616467 -0.812372
H  4.455433 2.522849 -1.91745
H  3.026616 1.466624 -2.200244
H  1.501632 1.02976 -0.651343
H  4.820501 -1.240542 1.138971
H  3.158246 -2.672287 2.297263
H  0.690607 -2.273847 2.000456
H  -2.928354 2.064573 -1.402044
H  -2.543322 -1.319566 1.296441
H  -5.417958 1.930337 -1.231442
H  -5.022268 -1.473832 1.476459
H  -7.221706 -0.573732 0.813131
H  -7.379357 0.784215 -0.26658
