program: Gaussian 16
title: Scaling factors
version: ES64L-G16RevC.01
frameworkgroup: D*H[C*(H.H)]
method: ROPBE
basis: 6-311++G(2d,2p)
operation: Freq
keyword: #N
keyword: Geom=AllCheck
keyword: Guess=TCheck
keyword: SCRF=Check
keyword: GenChk
keyword: ROPBE/6-311++G(2d,2p)Freq
converged: YES YES YES YES
title: Mulliken charges:
elementType: H H
charge: -0.000000 -0.000000
chargesum: -0.00000
title: Mulliken charges with hydrogens summed into heavy atoms:
1716.lowfreq: 0.0001 0.0001 0.0002 14.1688 14.1688 4358.2976
frequency: 4358.2976
redmass: 1.0078
irintensity: 0.0000
temp: 298.150 k
press: 1.00000 atm
elementType: 1 1
symmnumber: 2
zpe: 26068.4 jmol-1
zpe.correction: 0.009929 hartree
zpe.thermalcorrener: 0.012289 hartree
zpe.thermalcorrenthalpy: 0.013234 hartree
zpe.thermalcorrgfe: -0.001570 hartree
zpe.sumelectzpe: -1.169481 hartree
zpe.sumelectthermal: -1.167121 hartree
zpe.sumelectthermalent: -1.166176 hartree
zpe.sumelectthermalfe: -1.180980 hartree
dipole: 0.0000 0.0000 -0.0000
dipole: 0.0000
quadrupole: -2.0928 -2.0928 -1.4858
quadrupole: -0.0000 -0.0000 0.0000
quadrupole: -0.2023 -0.2023 0.4046 -0.0000 -0.0000 0.0000
hfenergy: -1.17941 hartree
pointgroup: D*H [C*(H1.H1)]
dipole: 0. 0. 0. debye
dipolederiv: 0. 0. 0. 0. 0. 0. 0. 0. 0. 0. 0. 0. 0. 0. 0. 0. 0. 0. unknown
polarizability: 2.8585892|0.|2.8585892|0.|0.|6.845682 unknown
InChI: InChI=1S/2H
charge 0 multiplicity 1
2 atoms
H  0.0000 0.0000 0.37369537
H  0.0000 0.0000 -0.37369537
