program: Gaussian 16
title: optppp
version: ES64L-G16RevA.03
frameworkgroup: C1[X(C42H24)]
method: RwB97XD
basis: def2SVP
operation: Freq
keyword: #PGeom=AllCheck
keyword: Guess=TCheck
keyword: SCRF=Check
keyword: GenChk
keyword: RwB97XD/def2SVP
keyword: Freq
title: opt ppp
converged: YES YES NO NO
title: Mulliken charges:
elementType: C C C C C C C C C C C C C C C C C C C C C C C C C C C C C C C C C C C C C C C C C C H H H H H H H H H H H H H H H H H H H H H H H H
charge: 0.052045 0.052306 -0.020535 0.017585 0.016966 0.016972 0.017107 0.016935 0.017559 -0.020511 -0.020417 -0.020151 0.052241 0.052111 -0.020830 0.052252 0.052297 -0.020294 -0.065665 -0.041372 -0.012792 -0.003252 -0.065707 -0.065661 -0.003270 -0.003307 -0.041523 -0.012801 -0.041455 -0.041231 -0.012830 -0.041211 -0.065649 -0.012719 -0.003245 -0.041141 -0.065614 -0.003266 -0.012717 -0.065693 -0.003296 -0.012846 0.029582 0.020871 0.018862 0.004858 0.004821 0.018874 0.020881 0.020896 0.018879 0.004846 0.004832 0.018888 0.020900 0.020881 0.018877 0.004822 0.004849 0.018875 0.020892 0.029520 0.029456 0.029442 0.029545 0.029477
chargesum: -0.00000
title: Mulliken charges with hydrogens summed into heavy atoms:
elementType: C C C C C C C C C C C C C C C C C C C C C C C C C C C C C C C C C C C C C C C C C C
charge: 0.052045 0.052306 -0.020535 0.017585 0.016966 0.016972 0.017107 0.016935 0.017559 -0.020511 -0.020417 -0.020151 0.052241 0.052111 -0.020830 0.052252 0.052297 -0.020294 -0.060819 -0.011916 0.008104 0.015627 -0.060849 -0.060840 0.015604 0.015555 -0.011940 0.008070 -0.011978 -0.011711 0.008051 -0.011769 -0.060817 0.008181 0.015642 -0.011596 -0.060792 0.015612 0.008164 -0.060845 0.015578 0.008046
chargesum: 0.00000
polarizability: 6.00668763e+02 4.63035361e-02 6.00493954e+02 -3.46656131e-02 1.24070149e-02 2.75085932e+02
1716.lowfreq: -6.3035 -2.0975 -0.0005 0.0005 0.0009 4.8560 34.2351 34.8208 53.9290
frequency: 34.2185 34.7739 53.9210 59.6429 66.5098 66.9770 93.0060 109.7070 110.8875 118.7626 119.4438 157.1030 176.5455 176.9944 206.3459 215.0917 235.3272 237.3004 263.7980 265.8029 298.0488 299.7690 303.2532 332.6306 348.8197 382.5413 382.7902 405.7734 423.1426 423.4885 435.6218 453.0330 453.5888 479.4754 482.9547 484.6977 503.0168 513.3636 513.7664 542.1651 559.7030 560.9861 579.0973 579.5464 589.4646 590.5958 593.3482 634.1572 634.5107 634.7130 639.8578 640.2356 678.8224 683.5560 683.9523 690.1658 739.1184 743.8987 744.0069 759.7222 767.7530 768.7082 774.7399 782.6910 786.2207 786.5192 801.2495 801.4317 809.6597 824.3522 825.8360 826.0750 836.3379 839.3601 856.9478 891.4326 891.4511 903.5271 904.3421 907.4712 924.4424 925.0821 927.8794 997.6285 999.7265 1001.1426 1004.1461 1006.2987 1006.5932 1017.3786 1028.3965 1029.6204 1029.7402 1032.5266 1033.5939 1035.1095 1036.4185 1038.2871 1038.9035 1041.3374 1083.6537 1084.0691 1087.8179 1088.5991 1090.8632 1096.1508 1123.8788 1124.3572 1148.6962 1150.5604 1151.0411 1170.4630 1182.0770 1183.5294 1184.3856 1187.2193 1189.7098 1192.9121 1199.4752 1200.4137 1251.2474 1254.3477 1254.8505 1271.6734 1274.5898 1277.7408 1304.3365 1309.7473 1310.4271 1327.1041 1330.2367 1349.9175 1369.3669 1375.6749 1376.0469 1388.7767 1390.6412 1391.6471 1393.5368 1408.4628 1439.0888 1439.4921 1483.9248 1484.9092 1485.3613 1494.4648 1497.2614 1497.8421 1521.0367 1521.8876 1542.1662 1544.5759 1548.1351 1548.7062 1604.1375 1604.6785 1633.9840 1662.1973 1662.3648 1669.2490 1670.7556 1670.8319 1700.4194 1700.5131 1701.3193 1702.8428 1703.7322 1703.9911 3206.6605 3206.9740 3207.0587 3208.0322 3208.1438 3208.2140 3219.1139 3219.2935 3219.4831 3222.1526 3222.4501 3222.6134 3230.2424 3230.3270 3230.5738 3236.5840 3238.8809 3239.1634 3243.0039 3244.1945 3244.3221 3247.0486 3249.8871 3258.4854
redmass: 5.5063 5.5081 5.3109 5.1197 5.1301 5.1346 4.2113 4.0279 4.0572 4.8831 4.9528 4.2821 4.6482 4.6335 5.1670 4.6254 5.2688 5.2840 5.2510 5.2570 5.1387 5.1467 5.1484 5.2617 7.0159 5.2006 5.2195 6.0195 6.2906 6.3080 3.9208 3.4637 3.5000 4.7456 4.2635 4.2998 3.4225 5.3830 5.3836 3.8607 4.7143 4.8196 4.6855 4.7315 3.4699 3.4584 3.2709 6.9391 7.0535 7.0417 6.9060 6.9005 6.0741 3.9990 4.0149 6.9000 5.6517 5.3593 5.4070 1.8396 1.7893 1.8129 1.3734 5.5425 1.7557 1.7412 1.9674 1.9635 3.5174 2.1388 4.7297 4.7757 2.2980 2.3466 3.0197 5.4369 5.3842 1.4709 1.4385 1.3988 2.0814 2.0501 2.1969 1.3906 1.3849 1.3850 1.3994 1.3952 1.3851 6.6939 3.1342 7.1135 6.6283 1.3876 1.4111 1.5838 1.5328 1.8218 1.3473 2.4701 1.9077 1.8772 1.7380 2.1107 2.2105 1.9513 2.7101 2.6786 1.8997 1.9027 1.9228 1.2865 1.2521 1.1870 1.1380 1.1301 1.2206 1.2025 1.3472 1.3045 2.6746 2.3632 2.4596 1.8240 1.7276 1.6515 1.5940 1.7651 1.7444 2.9886 2.8805 3.6259 6.9412 4.9797 4.9950 4.2046 3.8660 3.7332 3.9138 7.0457 4.7435 4.6745 2.7376 2.6454 2.6496 2.7223 3.0620 3.0351 3.4881 3.4157 3.4579 3.0872 3.3917 3.3440 5.4285 5.3336 5.9497 8.0951 8.0904 7.4744 7.7482 7.7495 6.5975 6.5953 6.2218 6.6398 6.4637 6.3931 1.0871 1.0870 1.0870 1.0876 1.0875 1.0875 1.0926 1.0926 1.0927 1.0936 1.0940 1.0942 1.0987 1.0987 1.0987 1.0948 1.0938 1.0940 1.0966 1.0962 1.0961 1.0953 1.0947 1.0932
irintensity: 0.0226 0.0194 0.6669 0.0025 0.1110 0.1233 0.7619 0.5475 0.5559 0.0111 0.0048 0.0014 0.4885 0.5305 1.4327 0.0038 0.5977 0.4984 1.6516 1.9585 0.6775 0.5464 0.0391 0.0014 0.6735 4.8271 4.7642 0.0003 0.7487 0.6955 1.1365 1.7087 1.5442 8.2785 1.8455 2.0457 0.0157 2.9495 3.0950 3.3597 0.6051 0.4861 6.7007 6.6971 0.0280 0.0322 0.0090 2.6248 4.5688 4.7524 0.0706 0.0904 0.0155 23.4703 23.1691 1.5506 3.1757 0.4661 0.6812 0.9511 24.0370 33.9314 161.0854 0.0273 0.0851 0.4573 28.2868 28.5182 22.8973 0.2546 0.1684 0.3041 14.4233 12.1956 0.0267 0.8892 0.8386 2.0139 1.2366 1.1748 0.0933 0.1702 0.0132 0.5467 0.5444 0.1873 1.1247 0.9776 0.9778 0.6179 0.0053 0.3674 0.3688 0.1047 0.2058 0.1579 0.5281 0.9839 0.7231 2.6619 7.7906 8.2595 6.2100 6.6949 6.5267 2.7919 1.2486 1.1831 0.0816 0.2689 0.2473 1.5635 0.0247 0.1237 0.6061 0.9497 1.0005 1.4109 1.0977 1.0326 0.5481 4.4907 4.6646 0.2192 0.6674 0.3746 0.0493 0.1367 0.2144 0.4073 0.3382 0.0147 1.3469 5.5239 5.3660 0.4306 0.3606 1.4864 3.7613 0.0228 16.4895 16.2435 0.5164 13.3270 13.6166 8.6255 20.9455 19.7751 13.5084 14.7331 1.6746 14.7344 2.6053 2.7771 1.1319 1.2480 0.0009 0.0439 0.0569 0.0128 0.1739 0.1674 0.0225 0.0354 0.0023 0.0686 0.1414 0.1213 0.1524 0.0537 0.0095 2.0643 1.7502 0.3657 12.7015 14.2773 14.8419 4.7970 8.0607 2.1243 5.4173 5.0889 5.0036 27.8391 26.9712 21.8413 5.0816 4.3908 4.3820 3.4723 3.1914 3.0743
temp: 298.150 k
press: 1.00000 atm
elementType: 6 6 6 6 6 6 6 6 6 6 6 6 6 6 6 6 6 6 6 6 6 6 6 6 6 6 6 6 6 6 6 6 6 6 6 6 6 6 6 6 6 6 1 1 1 1 1 1 1 1 1 1 1 1 1 1 1 1 1 1 1 1 1 1 1 1
symmnumber: 1
zpe: 1390042.3 jmol-1
zpe.correction: 0.529439 hartree
zpe.thermalcorrener: 0.557217 hartree
zpe.thermalcorrenthalpy: 0.558161 hartree
zpe.thermalcorrgfe: 0.473036 hartree
zpe.sumelectzpe: -1612.784230 hartree
zpe.sumelectthermal: -1612.756452 hartree
zpe.sumelectthermalent: -1612.755508 hartree
zpe.sumelectthermalfe: -1612.840633 hartree
dipole: 0.0007 -0.0007 0.0004
dipole: 0.0011
quadrupole: -212.8457 -212.8803 -241.6921
quadrupole: 0.0010 0.0023 -0.0013
quadrupole: 9.6270 9.5924 -19.2194 0.0010 0.0023 -0.0013
hfenergy: -1613.3136692 hartree
pointgroup: C01 [X(C42H24)]
dipole: -0.0003314 0.0001959 0.0001731 debye
polarizability: 600.6365939|0.0820521|600.5261232|0.0366418|-0.0036075|275.0859317 unknown
InChI: InChI=1S/C42H24/c1-7-19-31-25(13-1)26-14-2-8-20-32(26)38-37(31)39-33-21-9-3-15-27(33)28-16-5-11-23-35(28)41(39)42-36-24-12-6-18-30(36)29-17-4-10-22-34(29)40(38)42/h1-24H
charge 0 multiplicity 1
66 atoms
C  1.09135549 3.60788905 0.33885451
C  2.25030665 3.0248314 -0.33671007
C  -0.0724014 2.82169904 0.48688797
C  -0.07063969 1.41123059 0.05765911
C  1.17618955 0.78321613 -0.06108049
C  -1.266167 0.62691101 -0.06092778
C  -1.18663171 -0.76680951 0.05867847
C  0.09031317 -1.41008687 -0.06041625
C  1.2576884 -0.64432947 0.0576401
C  2.31078363 1.62206107 -0.4885657
C  0.24897444 -2.81210399 -0.48817262
C  2.48020096 -1.34840454 0.48601858
C  2.57909411 -2.74928308 0.33710487
C  1.49419997 -3.46112282 -0.33796905
C  -2.55976395 1.18986134 -0.48918461
C  -3.74429051 0.43594404 -0.33796307
C  -3.67010737 -0.8588007 0.33830968
C  -2.40741279 -1.47315949 0.488244
C  -4.81326852 -1.49590731 0.85977517
C  -2.33132953 -2.67647072 1.2237205
C  -3.46369439 -3.28532348 1.73035508
C  -4.72035919 -2.69878909 1.53470866
C  3.70283049 -3.42037093 0.85827567
C  1.6621192 -4.75955444 -0.85816301
C  0.63970591 -5.40145292 -1.53175118
C  4.69898238 -2.73795199 1.53139894
C  3.48546611 -0.68019626 1.21915369
C  4.57937619 -1.35607195 1.72531413
C  3.38506794 1.07376982 -1.22334658
C  -0.76396262 -3.46806395 -1.22188675
C  -0.57973721 -4.7409752 -1.72717741
C  -2.62168525 2.39400494 -1.22453865
C  -4.95299481 0.93897267 -0.85814855
C  -3.81644309 2.87021549 -1.72990487
C  -4.99810392 2.14462452 -1.53303151
C  -1.15382515 3.35744479 1.22047609
C  1.1106337 4.91611966 0.86136089
C  0.02153117 5.43686127 1.53499785
C  -1.1154478 4.64217156 1.72800412
C  3.290923 3.82003394 -0.85591597
C  4.35802055 3.25637004 -1.53020674
C  4.39542875 1.8703314 -1.72760098
H  3.38983744 0.38767097 1.41201109
H  5.33588395 -0.811592 2.29392777
H  5.55612688 -3.28013175 1.93590005
H  3.77654207 -4.50414668 0.760863
H  2.62661542 -5.25906352 -0.75960958
H  0.79560613 -6.40386166 -1.93566102
H  -1.38003602 -5.2179423 -2.29648366
H  -3.37040692 -4.21152973 2.30089785
H  -5.61848744 -3.16964631 1.93958857
H  -5.78862456 -1.01794688 0.7608742
H  -5.86760832 0.35327901 -0.75819947
H  -5.94435957 2.51036634 -1.93688773
H  -3.82963437 3.80109747 -2.30031749
H  -1.96521648 5.02447939 2.29704966
H  0.06251784 6.44979763 1.94064301
H  2.01235085 5.52194457 0.76461022
H  3.24140398 4.90494961 -0.7561061
H  5.14830863 3.89301538 -1.93319163
H  5.20849764 1.41633825 -2.29760212
H  -1.7046294 -2.95440301 -1.41646468
H  -1.35869648 -3.12629857 1.41903831
H  -1.70653356 2.95137323 -1.42043922
H  -2.03054519 2.7401377 1.41273379
H  3.41068362 0.00269479 -1.41993409
