program: Gaussian 16
title: TS
version: ES64L-G16RevA.03
frameworkgroup: CS[X(C66H36)]
method: RwB97XD
basis: def2SVP
operation: Freq
keyword: #PGeom=AllCheck
keyword: Guess=TCheck
keyword: SCRF=Check
keyword: GenChk
keyword: RwB97XD/def2SVP
keyword: Freq
converged: YES YES YES YES
title: Mulliken charges:
elementType: H C H C C C C C C H H C H H C C C C C C C C C C C C H H H H C C H H C C C C C C C H C H H C C C C H H C H C C C C C C C C H C H H C C C C H H C H C C C C C C C H H C C C C C C H H C C H H C C H H H H H H
charge: 0.018765 -0.002193 0.004169 -0.042606 -0.001747 0.028357 -0.023825 0.024628 -0.003823 0.020743 0.011846 -0.060513 0.002490 -0.000986 0.052030 0.052030 0.015579 0.015579 -0.035541 -0.035541 0.024628 -0.002193 0.028357 -0.001747 -0.023825 -0.042606 0.011846 0.020743 0.004169 0.018765 -0.060513 -0.003823 -0.000986 0.002490 -0.024225 0.038673 -0.163097 0.040898 0.000990 0.124527 -0.047508 -0.002640 -0.013954 0.000111 0.004026 0.009947 -0.039976 0.056312 -0.005659 0.005001 0.017362 -0.005189 0.011197 -0.010851 -0.024225 0.038673 -0.163097 0.040898 0.000990 0.124527 -0.047508 -0.002640 -0.013954 0.000111 0.004026 0.009947 -0.039976 0.056312 -0.005659 0.005001 0.017362 -0.005189 0.011197 -0.010851 0.017039 -0.015248 0.025169 -0.010904 -0.002636 -0.036595 0.006032 0.017625 0.017039 -0.015248 0.025169 -0.010904 -0.002636 -0.036595 0.006032 0.017625 -0.000144 -0.051656 0.006252 0.014245 -0.000144 -0.051656 0.006252 0.014245 0.014870 0.014870 0.012631 0.012631
chargesum: -0.00000
title: Mulliken charges with hydrogens summed into heavy atoms:
elementType: C C C C C C C C C C C C C C C C C C C C C C C C C C C C C C C C C C C C C C C C C C C C C C C C C C C C C C C C C C C C C C C C C C
charge: 0.016572 -0.038437 0.010099 0.028357 -0.003082 0.024628 -0.001333 -0.061499 0.052030 0.052030 0.015579 0.015579 -0.035541 -0.035541 0.024628 0.016572 0.028357 0.010099 -0.003082 -0.038437 -0.061499 -0.001333 -0.024225 0.038673 -0.163097 0.040898 0.000990 0.124527 -0.047397 -0.009928 0.009947 -0.034975 0.056312 0.011703 0.006008 -0.013491 -0.024225 0.038673 -0.163097 0.040898 0.000990 0.124527 -0.047397 -0.009928 0.009947 -0.034975 0.056312 0.011703 0.006008 -0.013491 0.017039 0.002377 0.025169 0.003967 0.009995 -0.030564 0.017039 0.002377 0.025169 0.003967 0.009995 -0.030564 0.006108 -0.037412 0.006108 -0.037412
polarizability: 5.15061123e+02 3.10109880e+01 9.50888552e+02 1.68019272e-06 -6.25465998e-06 8.59257401e+02
1716.lowfreq: -26.6484 -2.0073 -1.4415 -0.4553 -0.0004 0.0009 0.0010 18.6303 24.4454
redmass: 6.0614 5.8165 5.7198 5.5163 5.9347 5.6946 5.5183 5.3659 4.7390 5.0050 4.3672 5.1590 5.3007 5.8528 4.7037 4.6835 5.0899 5.3270 5.6640 4.3623 4.2135 5.0529 4.9620 5.3604 4.1006 4.1654 3.9142 4.6396 5.0880 5.1844 4.7544 4.6309 6.0988 6.5191 5.6685 5.4037 6.4124 5.0566 5.2076 5.3135 5.0539 4.8897 6.2539 4.4923 5.6212 3.6353 3.9725 3.7070 4.2176 4.2464 4.2151 3.8664 3.7765 4.3800 4.9424 5.5309 4.7660 5.1268 6.3950 5.7672 4.7189 3.8324 4.6689 6.4676 5.9338 5.0624 5.8970 5.8481 4.5092 4.6342 3.6641 3.7067 4.3427 3.7770 4.7993 4.0497 3.9975 4.0352 5.4914 5.4005 5.1759 7.0242 4.7625 6.3347 6.2358 4.9493 5.7619 5.3293 4.0332 5.5247 4.0548 2.5297 3.6047 4.4950 5.1243 3.3353 3.4261 1.5403 2.9560 1.3058 1.8955 1.3252 1.3651 2.2190 1.5793 5.1052 4.7570 3.8451 4.0804 2.3832 2.2186 2.5226 2.2559 2.4757 2.6432 2.8644 1.7557 1.8464 2.4863 2.6549 5.3982 3.4719 3.9148 4.3398 4.5905 2.8115 2.0457 3.4488 2.1912 3.1060 1.8359 1.8053 1.8670 2.2060 6.7818 5.4199 5.3002 5.9401 4.2674 1.3595 1.3340 1.3564 1.3783 1.3452 1.3436 1.3844 1.3887 1.3918 1.4026 1.3800 1.3688 1.3401 1.3604 1.3010 1.3428 1.3502 1.3562 5.1206 3.3729 2.5328 2.2638 2.4924 2.1732 2.0490 2.1340 2.9641 2.9566 2.8954 2.5238 2.1983 1.8056 1.5168 1.3810 1.3964 1.2269 1.3576 1.2207 1.3073 1.2408 1.2361 1.2088 1.3145 1.1653 1.4760 1.3531 1.2416 1.6602 1.8702 2.3879 1.9973 2.1722 2.1899 1.9233 1.8735 1.9098 1.8034 1.7217 1.7552 1.7740 1.6542 1.6957 2.0534 2.0495 2.1216 2.6735 3.8847 4.0170 5.5212 5.0607 5.0693 5.1731 4.4897 5.3002 4.5863 6.2527 6.9156 4.1727 6.3140 5.5955 6.4521 4.4352 3.6544 2.1981 3.0253 2.5355 2.6861 2.4979 2.6181 2.8139 3.5791 3.2105 3.2892 3.3361 3.1772 3.6761 3.8389 5.1048 4.6859 4.1758 4.3189 4.2270 5.2159 4.4509 4.7040 4.8931 4.8882 6.6601 8.2107 8.5914 8.4099 8.5189 8.6975 6.4933 6.5049 6.3440 6.5087 6.5137 6.5353 6.8550 6.7359 6.8141 7.0846 7.0258 7.1151 1.0881 1.0882 1.0873 1.0882 1.0882 1.0876 1.0906 1.0918 1.0910 1.0911 1.0903 1.0910 1.0909 1.0910 1.0923 1.0923 1.0921 1.0921 1.0960 1.0965 1.0984 1.0984 1.0994 1.0994 1.1006 1.0974 1.0968 1.0968 1.0965 1.0943 1.0943 1.0919 1.0919 1.0909 1.0921 1.0898
irintensity: 0.0505 0.0027 0.0186 0.0401 0.2637 0.3780 0.1636 0.2405 0.0258 0.0907 0.0000 0.0397 0.2177 0.0978 0.0061 0.5441 0.1213 0.5218 0.8869 0.2977 0.0528 0.0040 0.9892 0.5932 0.2195 1.4478 1.1822 0.0063 1.2642 1.0438 1.8637 0.7683 0.5251 1.3059 0.9542 0.8107 0.0073 1.8410 0.0023 5.6921 1.8074 0.0833 5.0257 0.1792 1.2314 0.1950 0.5524 0.3238 0.7210 0.3944 1.2355 8.8815 8.5578 9.3462 0.9166 3.7556 13.3132 9.9963 1.4012 5.1608 0.0650 0.0928 0.0084 3.0286 1.6379 19.2061 0.4223 0.3910 0.2732 2.8634 0.0332 3.4948 0.3980 1.9410 7.2533 11.7921 0.0280 2.6602 1.2695 21.1061 9.3990 4.6959 1.3971 1.8617 3.4748 13.0805 11.1519 0.4016 42.9424 1.2481 1.2465 28.6803 2.6654 9.1416 8.4441 1.4313 1.2261 33.1804 10.1665 12.2144 2.5042 22.2100 8.9547 18.5228 8.8406 13.9009 25.0351 31.9942 15.4232 8.4616 37.2805 23.3398 4.9123 4.1927 25.9842 24.4590 45.4003 1.5226 22.1209 0.1258 2.4007 10.1039 10.3913 1.9564 1.2000 0.3859 0.0088 7.5822 2.9083 2.3727 0.4286 3.4085 1.0908 0.0005 0.6723 1.4157 0.0662 1.8389 0.2716 0.9629 0.8683 0.1172 0.4174 0.9856 2.7983 0.0270 3.2532 0.8004 0.1448 0.6882 0.7277 0.0224 0.0388 1.3911 0.6409 0.0027 1.1785 6.8007 1.5600 2.1542 11.0139 5.3752 0.1249 1.4258 3.8436 2.1423 0.4379 0.8547 1.7911 1.8391 1.2299 0.4623 7.2123 1.4866 4.7630 0.4996 0.2927 1.3706 1.2091 1.1786 0.1193 0.0029 0.3637 1.6266 0.3735 1.0554 18.1938 2.7560 4.5989 0.5977 3.8182 2.6040 0.7534 1.8092 4.4404 11.0583 0.5989 3.6545 10.1632 2.2359 3.0689 11.0422 12.0275 0.5670 0.1068 3.2809 7.2570 7.2774 2.0861 2.7671 0.1057 0.0596 0.2232 3.4816 8.4448 0.3882 5.2617 3.3133 3.5367 0.0465 0.1187 0.6452 4.8684 3.1487 10.2286 0.0955 7.0904 0.4704 4.3977 13.1137 1.3539 3.3736 0.6130 2.9129 1.1993 0.2520 1.1445 5.9875 0.3817 1.5615 1.3145 0.0317 7.4807 10.9794 3.4711 6.3148 5.7059 0.1799 2.6571 1.4754 0.5310 0.3977 0.0115 2.8562 1.8977 8.9171 5.0861 1.0210 0.0410 1.1329 0.2485 0.1383 0.8933 0.3163 1.1040 3.2472 0.3223 2.5802 1.2846 4.3464 2.0535 10.6605 5.4869 2.8932 0.0649 6.6657 3.2503 17.4632 18.0448 5.9530 5.8007 14.1511 6.1770 37.0085 35.7116 2.8633 7.8617 31.6738 0.3169 8.8106 0.0020 1.7595 0.2473 0.1159 2.8313 19.0491 17.5788 18.2977 0.0007 2.7507
temp: 448.000 k
press: 1.00000 atm
elementType: 1 6 1 6 6 6 6 6 6 1 1 6 1 1 6 6 6 6 6 6 6 6 6 6 6 6 1 1 1 1 6 6 1 1 6 6 6 6 6 6 6 1 6 1 1 6 6 6 6 1 1 6 1 6 6 6 6 6 6 6 6 1 6 1 1 6 6 6 6 1 1 6 1 6 6 6 6 6 6 6 1 1 6 6 6 6 6 6 1 1 6 6 1 1 6 6 1 1 1 1 1 1
symmnumber: 1
zpe: 2131717.2 jmol-1
zpe.correction: 0.811928 hartree
zpe.thermalcorrener: 0.911675 hartree
zpe.thermalcorrenthalpy: 0.913094 hartree
zpe.thermalcorrgfe: 0.668098 hartree
zpe.sumelectzpe: -2533.318036 hartree
zpe.sumelectthermal: -2533.218289 hartree
zpe.sumelectthermalent: -2533.216870 hartree
zpe.sumelectthermalfe: -2533.461866 hartree
dipole: -0.2289 -0.0751 -0.0000
dipole: 0.2409
quadrupole: -370.4272 -329.7276 -344.8907
quadrupole: -1.8556 -0.0000 0.0000
quadrupole: -22.0787 18.6209 3.4578 -1.8556 -0.0000 0.0000
hfenergy: -2534.1299641 hartree
pointgroup: CS [X(C66H36)]
dipole: -0.0900583 -0.0295307 0. debye
polarizability: 515.0620293|31.0173544|950.8876458|0.0000017|-0.0000063|859.257401 unknown
InChI: InChI=1S/C66H36/c1-7-19-43-37(13-1)25-31-49-50-32-26-38-14-2-8-20-44(38)56(50)62-61(55(43)49)63-57-45-21-9-3-15-39(45)27-33-51(57)52-34-28-40-16-4-10-22-46(40)58(52)65(63)66-60-48-24-12-6-18-42(48)30-36-54(60)53-35-29-41-17-5-11-23-47(41)59(53)64(62)66/h1-36H
charge 0 multiplicity 1
102 atoms
H  2.2096445 -1.82519348 6.73271294
C  2.06576993 -1.85617432 5.65069746
H  2.46964476 -3.95955989 5.49096976
C  2.20074164 -3.04054871 4.96430462
C  1.57455102 -0.70641664 3.57943056
C  2.01895001 -3.09165823 3.56094578
C  1.78044965 -0.67314778 4.9408336
C  1.63317115 -1.92356267 2.85225574
C  2.26819217 -4.29468844 2.83275453
H  1.73034926 0.28170097 5.46795634
H  1.38866482 0.2300574 3.05717326
C  2.21655581 -4.31196161 1.47421543
H  2.55794992 -5.19251262 3.38374954
H  2.4878282 -5.2294571 0.95476664
C  1.78499784 -3.1685528 0.72582212
C  1.78499784 -3.1685528 -0.72582212
C  1.36865509 -2.02307495 1.42701451
C  1.36865509 -2.02307495 -1.42701451
C  0.60775953 -1.03880722 -0.69479715
C  0.60775953 -1.03880722 0.69479715
C  1.63317115 -1.92356267 -2.85225574
C  2.06576993 -1.85617432 -5.65069746
C  2.01895001 -3.09165823 -3.56094578
C  1.57455102 -0.70641664 -3.57943056
C  1.78044965 -0.67314778 -4.9408336
C  2.20074164 -3.04054871 -4.96430462
H  1.38866482 0.2300574 -3.05717326
H  1.73034926 0.28170097 -5.46795634
H  2.46964476 -3.95955989 -5.49096976
H  2.2096445 -1.82519348 -6.73271294
C  2.21655581 -4.31196161 -1.47421543
C  2.26819217 -4.29468844 -2.83275453
H  2.4878282 -5.2294571 -0.95476664
H  2.55794992 -5.19251262 -3.38374954
C  -0.41048316 2.3822417 -1.60348321
C  -1.40230144 2.20665718 -2.57870165
C  -0.21944493 -0.01654383 -1.33354098
C  -1.77343962 0.87432123 -2.99994888
C  -0.08794778 1.25472082 -0.74457742
C  -1.16683597 -0.24623899 -2.39786674
C  -2.62257816 0.69338414 -4.13895971
H  -0.97370577 -2.69714807 -1.0654676
C  -2.84515201 -0.53701074 -4.66830167
H  -3.04300472 1.56356071 -4.6402494
H  -3.43616995 -0.64848083 -5.58034413
C  -2.37146677 -1.70955794 -4.00553439
C  -2.72794906 -2.99303386 -4.48591684
C  -1.61083886 -1.57626387 -2.81213235
C  -2.41891301 -4.12827496 -3.77346146
H  -3.28129119 -3.06156714 -5.42583776
H  -2.70039557 -5.11371248 -4.15020447
C  -1.78808465 -3.99811015 -2.52255125
H  -1.60796389 -4.8798984 -1.90430498
C  -1.40844044 -2.75856351 -2.05617216
C  -0.41048316 2.3822417 1.60348321
C  -1.40230144 2.20665718 2.57870165
C  -0.21944493 -0.01654383 1.33354098
C  -1.77343962 0.87432123 2.99994888
C  -0.08794778 1.25472082 0.74457742
C  -1.16683597 -0.24623899 2.39786674
C  -2.62257816 0.69338414 4.13895971
H  -0.97370577 -2.69714807 1.0654676
C  -2.84515201 -0.53701074 4.66830167
H  -3.04300472 1.56356071 4.6402494
H  -3.43616995 -0.64848083 5.58034413
C  -2.37146677 -1.70955794 4.00553439
C  -2.72794906 -2.99303386 4.48591684
C  -1.61083886 -1.57626387 2.81213235
C  -2.41891301 -4.12827496 3.77346146
H  -3.28129119 -3.06156714 5.42583776
H  -2.70039557 -5.11371248 4.15020447
C  -1.78808465 -3.99811015 2.52255125
H  -1.60796389 -4.8798984 1.90430498
C  -1.40844044 -2.75856351 2.05617216
C  0.33844922 3.62449215 -1.66400347
C  1.85379695 5.97057857 -2.05170735
C  -0.24194676 4.76948124 -2.26929085
C  1.72656797 3.64636205 -1.40825197
C  2.47376724 4.78623103 -1.61627049
C  0.51445856 5.95784452 -2.38067213
H  0.03922587 6.84722291 -2.80198119
H  2.44242967 6.88141941 -2.17964724
C  0.33844922 3.62449215 1.66400347
C  1.85379695 5.97057857 2.05170735
C  -0.24194676 4.76948124 2.26929085
C  1.72656797 3.64636205 1.40825197
C  2.47376724 4.78623103 1.61627049
C  0.51445856 5.95784452 2.38067213
H  0.03922587 6.84722291 2.80198119
H  2.44242967 6.88141941 2.17964724
C  -1.51371045 4.62844792 -2.91087117
C  -2.00576823 3.38412282 -3.14735329
H  -2.01322501 5.51174134 -3.31513237
H  -2.90574347 3.27986698 -3.75254703
C  -1.51371045 4.62844792 2.91087117
C  -2.00576823 3.38412282 3.14735329
H  -2.01322501 5.51174134 3.31513237
H  -2.90574347 3.27986698 3.75254703
H  2.21498356 2.72278408 1.09604797
H  2.21498356 2.72278408 -1.09604797
H  3.55029242 4.76896601 1.43522991
H  3.55029242 4.76896601 -1.43522991
