program: Gaussian 09
title: 000047892
version: EM64L-G09RevD.01
frameworkgroup: C1[X(C13H21N2O)]
method: RPBEPBE
basis: SDD
operation: Freq
keyword: #p
keyword: freq=noraman
keyword: PBEPBE/SDD
title: #p freq=noraman PBEPBE/SDD
converged: YES YES NO NO
title: Mulliken charges:
elementType: O N N C C C C C C C C C C C C C H H H H H H H H H H H H H H H H H H H H H
charge: -0.359203 -0.037958 -0.038955 -0.368049 -0.380018 -0.365844 -0.353661 -0.423006 -0.356193 -0.686805 -0.248330 -0.142898 0.408595 -0.172467 -0.269241 -0.288045 0.211181 0.208665 0.200867 0.202711 0.228864 0.228887 0.195963 0.194416 0.254133 0.257901 0.198022 0.199006 0.212035 0.212437 0.227733 0.320493 0.292311 0.280002 0.284569 0.269960 0.401922
chargesum: 1.00000
title: Mulliken charges with hydrogens summed into heavy atoms:
elementType: O N N C C C C C C C C C C C C C
charge: 0.042719 -0.037958 -0.038955 0.051797 0.023560 0.091907 0.036718 0.089028 0.040835 -0.034599 0.072163 0.149413 0.408595 0.107535 0.015328 -0.018085
polarizability: 2.17887771e+02 2.05690741e+01 1.93974179e+02 -1.60325873e+01 1.11644629e+01 1.05148266e+02
1716.lowfreq: -7.6572 -7.1840 -0.0005 0.0005 0.0008 5.1492 15.1470 30.3169 43.1999
frequency: 14.8462 30.0750 43.1395 55.8603 87.6282 92.6013 100.9947 118.1638 133.0898 142.7134 158.8114 206.9311 212.1029 238.0176 288.4577 324.0998 341.9771 372.5837 403.5654 434.0751 456.7727 471.5336 518.9747 561.4685 613.7038 648.8197 690.6460 725.6971 738.3135 767.7045 769.3442 816.5983 828.9917 893.1310 910.6394 914.9996 939.3083 943.6330 951.6419 971.2353 991.9566 1002.0047 1003.0838 1019.5520 1029.0688 1040.3778 1066.4212 1078.2937 1097.0993 1117.9896 1134.8261 1153.8713 1190.8501 1203.8502 1226.7861 1230.4513 1233.1773 1245.8113 1268.4777 1275.6363 1282.2206 1293.3193 1299.7727 1317.9598 1326.5327 1339.6006 1349.7864 1354.0048 1375.1802 1395.2404 1402.2896 1438.8398 1462.7818 1463.1987 1467.6119 1474.0701 1480.3710 1481.2581 1487.5913 1489.7345 1497.2196 1564.5676 1580.9051 1621.4412 2957.3367 2960.7677 2967.1236 2972.5500 2978.9394 2982.8147 2994.2307 3006.2013 3021.5112 3031.6729 3037.6883 3051.0503 3074.4860 3081.5808 3098.1828 3101.0358 3167.2125 3190.0122 3192.0679 3209.8670 3539.4193
redmass: 4.8229 1.9437 3.5383 2.5174 2.2156 2.6235 3.6684 2.8821 2.3212 2.2958 4.9620 4.5825 3.4166 1.1125 4.2234 3.2442 3.2940 6.9895 3.4444 3.1732 3.5118 3.0065 1.1379 4.2844 4.9023 6.3066 2.0957 1.0645 1.0836 1.1370 4.6639 1.5016 1.2170 1.8952 1.3659 1.2958 1.4694 1.4631 3.1728 8.4810 4.0564 1.2669 1.3473 4.5442 3.3037 3.2517 2.6620 2.3895 2.1110 2.6083 1.8945 1.5351 1.6040 1.1486 1.2812 1.2369 1.3610 2.1238 1.2342 1.2798 1.0645 1.0997 1.1126 1.2990 1.3464 1.3285 1.4677 1.5916 4.1074 1.2117 1.7474 1.8977 1.0890 1.0710 1.0902 1.0917 1.0466 1.1135 1.3929 1.3495 1.3753 4.6872 5.6343 5.4345 1.0587 1.0588 1.0593 1.0592 1.0362 1.0586 1.0977 1.1004 1.1033 1.0592 1.1046 1.1049 1.1007 1.0993 1.0919 1.1078 1.0925 1.0941 1.0937 1.1009 1.0680
irintensity: 0.6741 0.0223 0.1314 0.1554 0.2764 0.5173 0.7649 0.3129 0.5193 0.3276 0.1681 0.2580 0.9565 0.0017 0.0061 1.3390 1.2838 7.0863 0.1842 2.6420 0.7410 9.8141 172.1722 8.1612 1.1764 29.5364 44.7751 12.7517 0.5016 3.1778 10.2004 32.6900 1.6789 2.6423 0.5939 1.8269 22.6344 16.6279 32.8178 167.9551 1.3892 1.1252 0.3751 1.0747 1.2490 1.3451 0.0385 2.4301 0.9534 29.4787 40.6084 1.2531 0.4331 3.8974 13.9450 87.9028 0.1876 17.3175 0.8555 0.4948 3.8918 0.0370 0.0555 0.8234 1.8603 2.3430 0.2294 0.5792 13.1972 10.2863 37.0918 15.2154 1.1164 1.2251 7.3942 1.9862 10.4899 11.4960 18.7106 46.8072 22.5787 26.3591 103.8638 8.8433 0.7438 0.6370 2.6506 93.3131 36.0542 47.0621 0.0841 0.2975 0.4041 12.0746 21.3094 77.1589 78.3924 40.7041 2.6207 9.6292 0.6825 5.6026 1.3075 3.2632 190.4529
temp: 298.150 k
press: 1.00000 atm
elementType: 8 7 7 6 6 6 6 6 6 6 6 6 6 6 6 6 1 1 1 1 1 1 1 1 1 1 1 1 1 1 1 1 1 1 1 1 1
symmnumber: 1
zpe: 839800.8 jmol-1
zpe.correction: 0.319863 hartree
zpe.thermalcorrener: 0.337568 hartree
zpe.thermalcorrenthalpy: 0.338512 hartree
zpe.thermalcorrgfe: 0.271241 hartree
zpe.sumelectzpe: -691.188077 hartree
zpe.sumelectthermal: -691.170372 hartree
zpe.sumelectthermalent: -691.169428 hartree
zpe.sumelectthermalfe: -691.236699 hartree
dipole: 7.8431 -3.1583 0.6925
dipole: 8.4834
quadrupole: -46.8856 -64.9801 -93.4626
quadrupole: -2.5267 -4.4827 4.5227
quadrupole: 21.5572 3.4627 -25.0198 -2.5267 -4.4827 4.5227
hfenergy: -691.5079403 hartree
pointgroup: C01 [X(C13H21N2O1)]
dipole: 3.0845912 -1.2409534 0.2918726 debye
polarizability: 217.9019419|20.2584313|194.302694|-16.5002701|9.5510178|104.8055806 unknown
InChI: InChI=1S/C13H21N2O/c1-2-3-4-5-6-9-15-10-7-8-13(12-15)11-14-16/h7-8,10-12,16H,2-6,9H2,1H3
charge 1 multiplicity 1
37 atoms
O  4.714189 3.244468 -0.0858
N  1.16263 -1.067404 0.519719
N  3.726722 2.2402 0.124209
C  -2.654368 -0.293782 0.669653
C  -3.709286 0.146098 -0.372318
C  -1.25207 -0.477668 0.042069
C  -5.114297 0.336479 0.243348
C  -0.215529 -0.887942 1.110468
C  -6.170954 0.786565 -0.791663
C  -7.569595 0.983384 -0.168945
C  1.983569 0.020424 0.400122
C  1.543127 -2.306129 0.052229
C  3.260702 -0.088375 -0.203442
C  2.797824 -2.472105 -0.551944
C  3.663332 -1.36689 -0.682998
C  4.14437 1.074331 -0.330234
H  -2.981368 -1.24267 1.141918
H  -2.605649 0.462957 1.479506
H  -3.38655 1.096223 -0.845949
H  -3.765005 -0.607521 -1.18476
H  -0.935389 0.468177 -0.440155
H  -1.29889 -1.24865 -0.752017
H  -5.445458 -0.6133 0.712182
H  -5.061883 1.086649 1.059639
H  -0.498783 -1.84151 1.588512
H  -0.141078 -0.119969 1.899692
H  -5.839639 1.733372 -1.264633
H  -6.230125 0.035143 -1.605143
H  -7.549162 1.757534 0.620771
H  -7.938152 0.04609 0.288253
H  -8.306405 1.298453 -0.929216
H  1.620968 0.974096 0.79043
H  0.831014 -3.122538 0.183977
H  3.087302 -3.462094 -0.910931
H  4.644822 -1.491071 -1.151431
H  5.131622 0.951253 -0.799599
H  4.315142 4.075922 0.286082
