program: Gaussian 09
title: 000046763
version: EM64L-G09RevD.01
frameworkgroup: C1[X(C21H28NO3)]
method: RPBEPBE
basis: SDD
operation: Freq
keyword: #p
keyword: freq=noraman
keyword: PBEPBE/SDD
title: #p freq=noraman PBEPBE/SDD
converged: NO YES NO NO
title: Mulliken charges:
elementType: O O O N C C C C C C C C C C C C C C C C C C C C C H H H H H H H H H H H H H H H H H H H H H H H H H H H H
charge: -0.262123 -0.424900 -0.222754 -0.110098 -0.003252 -0.362549 -0.608479 -0.577135 -0.698228 -0.704628 -0.329802 -0.109167 0.175265 0.438766 0.331642 -0.378927 -0.415080 -0.335924 -0.396872 -0.237734 -0.248979 -0.235302 -0.220727 -0.229219 -0.234860 0.257876 0.312809 0.284471 0.322954 0.267461 0.252716 0.269240 0.270058 0.267717 0.260422 0.242010 0.261200 0.239082 0.243480 0.266649 0.250591 0.273197 0.362935 0.251756 0.268172 0.247913 0.287813 0.236671 0.235502 0.235904 0.245675 0.241276 0.245513
chargesum: 1.00000
title: Mulliken charges with hydrogens summed into heavy atoms:
elementType: O O O N C C C C C C C C C C C C C C C C C C C C C
charge: -0.262123 -0.061965 -0.222754 -0.110098 0.254623 0.234732 0.234653 0.229880 0.065404 0.044584 0.193986 -0.109167 0.175265 0.438766 0.331642 -0.127171 -0.146908 -0.088011 -0.109059 -0.001062 -0.013477 0.000602 0.024948 0.012057 0.010653
polarizability: 2.44708803e+02 -1.82175948e+01 2.54782199e+02 -9.25386024e+00 -6.96886161e+00 2.02586255e+02
1716.lowfreq: -20.3662 -7.0461 -0.0006 -0.0006 -0.0003 2.3972 9.2580 16.4190 19.2919
frequency: -16.2050 13.4707 19.1558 30.2495 43.3794 49.8052 55.1472 73.4685 87.3957 132.8617 142.9617 170.4507 194.6981 198.4474 222.8120 230.5292 236.6231 240.6245 257.2795 268.5011 275.6430 288.4222 308.7748 331.1403 342.5488 354.8246 362.5079 374.3792 396.4049 399.5238 400.7349 413.8083 432.1375 451.8987 469.8556 476.3166 504.9119 537.9919 559.8990 603.2891 615.1056 616.8297 656.2517 679.7044 695.0538 702.3749 714.2747 728.2917 755.1368 771.0031 782.5482 818.3306 853.8303 855.8869 870.5691 891.0874 900.3461 922.7610 931.8193 936.0340 941.1064 947.2223 963.0506 978.3649 981.8804 986.5120 991.1170 992.8399 995.2934 1005.2085 1009.6275 1028.6945 1030.5297 1041.4566 1055.5278 1076.8458 1088.8775 1092.3204 1105.8350 1106.8757 1140.6910 1150.8316 1175.3348 1177.5916 1178.2709 1180.0392 1182.3342 1190.9875 1193.1810 1194.6263 1219.3481 1265.5325 1308.4841 1310.3517 1319.9588 1321.1468 1321.4083 1337.4349 1357.8884 1379.1862 1384.9913 1391.9200 1405.1351 1425.6449 1428.8398 1433.6149 1437.9545 1445.5202 1453.3384 1457.8752 1462.1951 1469.7188 1473.7286 1475.8748 1483.5975 1483.8700 1485.0369 1489.8724 1501.0407 1506.7006 1588.3114 1596.2218 1604.0267 1611.9919 1632.3375 3005.3858 3007.7949 3016.3529 3029.0975 3033.4202 3042.7646 3058.3827 3092.2257 3098.6261 3109.2160 3117.1946 3118.8005 3120.3951 3132.8486 3135.6826 3137.2864 3139.0657 3139.7901 3145.8689 3146.0121 3151.1863 3155.9849 3158.4353 3160.4333 3160.6553 3172.6724 3173.0790 3526.3691
redmass: 3.4958 4.2581 4.0410 3.1385 3.3715 3.3825 3.2628 4.2989 4.1827 3.8849 5.9916 2.7770 1.8715 2.5542 4.2389 1.1433 1.8526 1.5354 1.2780 3.5086 5.3364 2.7273 2.7721 4.3603 3.4004 1.9697 1.9950 2.5111 2.9878 2.7838 2.8183 2.4024 2.8909 2.7820 4.1772 3.0742 3.6558 2.5961 5.1622 6.3499 6.4224 6.3929 4.3242 3.3388 6.9473 1.8374 2.0956 4.2235 1.8813 1.7687 3.1602 1.9158 1.2519 2.8743 1.2419 2.6523 4.7081 2.3485 1.6014 1.1914 1.9083 1.5414 2.1657 4.1662 1.4253 3.4017 5.5058 2.0323 3.0741 1.3866 1.3517 2.3151 2.1598 2.8778 1.4660 2.2639 1.3906 1.6466 1.6177 2.8694 1.8921 2.5363 1.2173 1.8790 1.0518 1.8886 1.9804 1.6378 1.2020 1.1359 1.7621 1.2086 1.5453 1.1657 1.3886 1.4871 1.3674 1.2153 1.2371 8.3132 8.9451 1.2416 1.1859 1.1783 1.1512 2.1853 2.2086 1.0993 1.1050 1.0581 1.0565 1.0770 1.0559 2.0867 1.0638 2.2107 1.0471 1.0562 1.0491 1.0543 6.1332 6.2128 5.9123 6.1365 10.4388 1.0376 1.0394 1.0855 1.0330 1.0341 1.0595 1.0589 1.0987 1.0973 1.1018 1.1009 1.1046 1.0867 1.0854 1.1050 1.0891 1.1063 1.0881 1.1019 1.0941 1.0927 1.1047 1.1055 1.0958 1.0948 1.1011 1.1005 1.0650
irintensity: 0.3534 0.4040 0.5039 1.8084 2.0374 0.4596 1.7298 0.0245 3.4545 4.9372 0.6204 0.3304 1.5161 1.0151 1.7139 0.4514 0.7245 0.4099 2.7367 1.1936 1.0245 3.5091 11.6891 20.2855 2.9595 36.3738 41.3542 1.4637 38.9375 1.6301 0.1770 27.4464 7.8372 0.1675 3.5811 3.9558 4.5038 5.4771 4.9754 23.0890 0.0166 1.3244 22.0714 10.4627 2.9192 48.6346 39.4361 3.3738 117.4259 47.7198 24.8482 23.4691 0.4495 33.1929 0.9964 9.9389 2.4211 10.9210 13.8362 3.5438 32.8009 4.3036 45.0806 38.2257 1.1054 5.2549 7.6746 8.8832 40.1593 4.7458 0.7866 1.3821 12.3540 9.3949 6.9806 96.2176 0.7610 24.3319 38.9639 131.7738 1.0332 36.5006 3.7231 6.0249 0.0533 9.4351 8.1947 0.9652 2.3423 2.6836 2.3529 2.3814 62.3632 6.6026 11.7312 1.6134 13.7112 14.7500 4.2804 0.1802 0.0182 4.9813 17.8017 42.1550 27.6996 14.4127 16.8800 3.9278 20.9778 2.8793 7.1884 2.5869 7.4139 14.7102 23.1449 11.2193 12.0401 88.7167 37.0316 10.6766 0.6828 0.7561 5.7801 3.5910 86.4956 4.5546 1.2963 7.9584 2.6398 5.4862 26.4743 2.6302 1.9723 13.2517 18.8222 11.8023 2.9853 3.2901 1.4291 3.2679 2.3635 3.0300 1.2863 4.0574 19.9848 13.5499 2.5597 5.5409 13.4752 15.8552 20.0905 9.7013 13.0777
temp: 298.150 k
press: 1.00000 atm
elementType: 8 8 8 7 6 6 6 6 6 6 6 6 6 6 6 6 6 6 6 6 6 6 6 6 6 1 1 1 1 1 1 1 1 1 1 1 1 1 1 1 1 1 1 1 1 1 1 1 1 1 1 1 1
symmnumber: 1
zpe: 1175859.2 jmol-1
zpe.correction: 0.447861 hartree
zpe.thermalcorrener: 0.472486 hartree
zpe.thermalcorrenthalpy: 0.473430 hartree
zpe.thermalcorrgfe: 0.392148 hartree
zpe.sumelectzpe: -1095.319443 hartree
zpe.sumelectthermal: -1095.294817 hartree
zpe.sumelectthermalent: -1095.293873 hartree
zpe.sumelectthermalfe: -1095.375156 hartree
dipole: -16.9019 -1.8250 -0.6792
dipole: 17.0137
quadrupole: -63.0278 -118.5621 -134.5642
quadrupole: 11.8373 -2.1699 -3.3422
quadrupole: 42.3569 -13.1774 -29.1795 11.8373 -2.1699 -3.3422
hfenergy: -1095.7673037 hartree
pointgroup: C01 [X(C21H28N1O3)]
dipole: -6.6870041 -0.2689633 0.1313721 debye
polarizability: 241.4456405|-20.2819328|249.5458632|-5.9168627|-19.3733688|211.0857532 unknown
InChI: InChI=1S/C21H28NO3/c1-17(2)22(3,4)15-16-25-20(23)21(24,18-11-7-5-8-12-18)19-13-9-6-10-14-19/h5-14,17,24H,15-16H2,1-4H3
charge 1 multiplicity 1
53 atoms
O  -0.653062 -0.365024 1.848845
O  1.887888 0.249135 2.123546
O  -0.351407 -1.45523 -0.183217
N  -4.067676 -0.767232 0.24259
C  -4.802471 0.1971 -0.79792
C  -2.88882 -0.030619 0.903231
C  -3.581522 -2.015938 -0.511719
C  -5.063988 -1.213648 1.311103
C  -3.90241 0.533288 -2.001246
C  -5.347671 1.476367 -0.137934
C  -2.031396 -0.903859 1.852726
C  1.488918 0.005413 0.732823
C  0.118396 -0.721048 0.710461
C  2.57938 -0.901675 0.137083
C  1.265771 1.336539 -0.033567
C  3.226224 -0.616518 -1.085903
C  0.55659 1.382105 -1.262767
C  2.94718 -2.059196 0.869255
C  1.815763 2.52876 0.495466
C  4.22888 -1.484877 -1.576214
C  0.387849 2.61014 -1.941598
C  3.94599 -2.924446 0.378719
C  1.643623 3.755108 -0.18574
C  4.588927 -2.640834 -0.849568
C  0.925003 3.802135 -1.402041
H  -5.649201 -0.431433 -1.135743
H  -2.253231 0.340977 0.085728
H  -3.308675 0.831825 1.443085
H  -2.60371 -1.816911 -0.971731
H  -4.332633 -2.280078 -1.270979
H  -3.47834 -2.852422 0.194226
H  -5.40676 -0.347298 1.892654
H  -4.572633 -1.933558 1.982776
H  -5.921139 -1.700352 0.820441
H  -3.506383 -0.353533 -2.520118
H  -3.063797 1.198618 -1.732366
H  -4.520924 1.081893 -2.733008
H  -6.01345 1.29192 0.720551
H  -4.545715 2.171325 0.163716
H  -5.953954 2.004069 -0.894762
H  -1.994127 -1.959721 1.535741
H  -2.35082 -0.83146 2.90219
H  1.127535 0.661344 2.613119
H  2.968029 0.282433 -1.653734
H  0.172626 0.457668 -1.711168
H  2.476112 -2.258631 1.838031
H  2.393517 2.48149 1.423441
H  4.732293 -1.252618 -2.520754
H  -0.139657 2.633873 -2.902047
H  4.230037 -3.812014 0.954223
H  2.081811 4.669811 0.227561
H  5.368126 -3.309896 -1.230215
H  0.800403 4.752729 -1.931473
