program: Gaussian 09
title: 000007097
version: EM64L-G09RevD.01
frameworkgroup: C1[X(C9H9NO7)]
method: RPBEPBE
basis: SDD
operation: Freq
keyword: #pfreq=noraman
keyword: PBEPBE/SDD
title: #p freq=noraman PBEPBE/SDD
converged: YES YES NO NO
title: Mulliken charges:
elementType: O O O O O O O N C C C C C C C C C H H H H H H H H H
charge: -0.194409 -0.237456 -0.260527 -0.219116 -0.207632 -0.207345 -0.185724 0.050245 -0.089175 0.353276 -0.325321 0.274687 -0.303174 0.321951 0.314253 -0.749811 -0.745636 0.295167 0.286609 0.295318 0.255553 0.251444 0.259989 0.263922 0.250007 0.252902
chargesum: 0.00000
title: Mulliken charges with hydrogens summed into heavy atoms:
elementType: O O O O O O O N C C C C C C C C C
charge: -0.194409 -0.237456 -0.260527 -0.219116 -0.207632 -0.207345 -0.185724 0.050245 0.205992 0.353276 -0.038712 0.274687 -0.007856 0.321951 0.314253 0.017176 0.021196
polarizability: 1.86765764e+02 -2.72422127e+00 1.22089770e+02 -9.12749847e-01 1.52071711e+01 1.04879410e+02
1716.lowfreq: -7.2620 -0.0007 -0.0006 0.0007 1.7256 4.1087 17.5423 32.3420 43.9966
frequency: 17.5156 32.2387 43.9892 51.0181 59.6505 61.9421 80.9063 89.6777 94.3590 142.0993 159.5421 206.5908 214.0004 244.3902 281.8538 320.6145 326.0601 431.6328 464.1895 487.3960 542.6362 554.0895 565.4291 569.4833 581.7622 628.4019 647.4752 688.0346 735.9795 765.8635 816.2810 829.9628 872.9362 897.3450 908.0523 920.9555 936.2198 982.4494 984.3976 1005.7058 1018.8647 1042.3318 1043.2070 1134.3989 1162.6663 1163.9201 1185.0068 1210.1533 1257.9569 1306.1841 1333.3719 1359.8048 1371.5801 1385.4873 1387.3994 1451.3494 1451.6808 1451.9661 1453.6370 1507.9750 1579.7770 1674.0430 1691.8361 3008.7086 3010.4372 3021.5563 3098.4888 3101.3166 3145.4915 3147.0312 3245.2204 3262.4140
redmass: 6.2677 7.5347 8.3134 1.3808 4.8808 5.1095 2.1975 5.1947 1.1172 8.5146 8.7302 9.0504 5.6894 7.4824 5.2428 4.8109 5.4699 6.5351 5.1456 5.3190 5.2211 3.6315 3.5567 5.2537 5.7823 5.3829 5.2266 8.4658 12.6419 5.2192 2.7857 1.8356 6.0208 6.1667 1.5837 6.2667 5.1259 2.8127 2.3206 2.7253 1.3125 1.6682 1.6666 5.4761 2.9523 3.9235 3.0524 1.7170 5.8894 1.1823 2.9730 4.7550 2.8042 1.2451 1.2505 1.0502 1.0517 1.0541 1.0528 9.2377 7.2931 9.9910 10.3582 1.0383 1.0368 1.0836 1.0971 1.0945 1.1022 1.1012 1.0954 1.1046
irintensity: 2.5273 0.5198 2.0194 2.5299 1.3262 0.7630 1.3823 2.4152 0.5593 2.7366 3.1376 2.6913 8.3942 2.8105 1.9101 1.0506 9.7545 12.5180 12.6833 5.5811 7.9735 0.4702 11.7532 0.7133 5.1140 12.0325 3.1696 11.2786 24.0401 2.5191 7.2868 93.3730 185.9087 291.3623 14.0677 70.8242 1.8820 37.3504 31.1585 146.9679 36.5276 7.7401 10.4102 22.5125 187.1587 156.2908 492.6567 64.1209 142.9742 7.4799 2.2869 145.6877 20.4058 58.5377 53.3295 24.4161 29.7059 18.0510 17.5381 81.6902 7.2644 116.9174 243.1172 0.3540 0.4381 18.9612 3.6523 5.1255 6.7287 7.9372 0.0763 5.6827
temp: 298.150 k
press: 1.00000 atm
elementType: 8 8 8 8 8 8 8 7 6 6 6 6 6 6 6 6 6 1 1 1 1 1 1 1 1 1
symmnumber: 1
zpe: 465995.6 jmol-1
zpe.correction: 0.177488 hartree
zpe.thermalcorrener: 0.194848 hartree
zpe.thermalcorrenthalpy: 0.195792 hartree
zpe.thermalcorrgfe: 0.128297 hartree
zpe.sumelectzpe: -928.298414 hartree
zpe.sumelectthermal: -928.281055 hartree
zpe.sumelectthermalent: -928.280110 hartree
zpe.sumelectthermalfe: -928.347606 hartree
dipole: 4.6779 -1.4825 -5.1558
dipole: 7.1178
quadrupole: -115.5664 -82.9706 -102.0327
quadrupole: 4.5788 -2.4711 1.4165
quadrupole: -15.3765 17.2193 -1.8428 4.5788 -2.4711 1.4165
hfenergy: -928.4759029 hartree
pointgroup: C01 [X(C9H9N1O7)]
dipole: -1.7423186 -0.7639125 2.0549236 debye
dipolederiv: -0.2371429 -0.0612779 -0.1240298 -0.0125882 -0.2067698 0.1799773 -0.122466 0.1717566 -0.4337638 -1.6718125 0.4776494 -0.4369908 0.4707783 -0.7929274 0.1000249 -0.4010827 0.0862011 -0.417831 -0.6754882 -0.590787 -0.0570552 -0.3906914 -1.6323108 -0.217576 -0.073103 -0.1824784 -0.4754103 -0.7365192 0.1300759 -0.1848938 -0.1928582 -0.6039592 -0.2987305 -0.4063966 -0.0999501 -0.5662687 -0.383112 -0.0121208 0.2268149 -0.1884893 -0.6610106 -0.0381536 0.0541136 -0.3945496 -0.7838376 -0.9457957 -0.1835766 -0.1295578 -0.145425 -0.3362641 0.0767257 -0.2095381 0.0480427 -0.4343652 -0.4292975 -0.0689838 -0.0251622 -0.1472908 -0.4251118 0.2631975 0.102891 0.3009032 -0.642596 1.6353874 0.5439289 -0.0341868 0.671085 0.7690417 -0.5005747 -0.1937562 -0.5462173 0.9871379 1.316781 0.1293663 0.1779818 -0.2865649 1.2470981 -0.0980736 -0.1477122 -0.3146421 0.2635253 0.2486513 0.1090476 0.0808166 -0.1920002 -0.0705836 -0.1307345 0.2356273 -0.0127252 0.2179252 -0.4696834 -0.1030903 -0.0259886 0.0651924 -0.0799237 -0.0594712 -0.2431815 -0.15655 -0.0368479 -0.3673887 -0.285594 0.2336576 -0.5523454 -0.2033061 0.1301018 0.6085914 0.2950888 0.0209217 0.2366407 0.1309167 0.0066368 0.2770293 0.0456133 -0.0840678 -0.2243823 -0.1705556 0.0132438 1.6327027 -0.6047363 0.5143861 -0.1630632 0.9833045 0.34931 0.8881975 0.0798105 0.7691699 0.6125743 0.520578 -0.276133 0.7404947 1.7227889 0.2436382 -0.0472778 0.7762276 1.0707345 -0.1196894 0.1297417 0.0133296 0.1897942 -0.3278572 -0.0939793 0.017457 -0.154877 -0.0493518 -0.1965095 -0.2302173 0.1629897 -0.1541014 -0.1647075 0.0787508 0.1467693 0.1084994 -0.109594 0.0027357 -0.0505164 -0.0296465 0.1040564 0.0807531 0.0081148 0.0941105 0.0625753 0.039497 0.1239442 -0.0421861 0.039932 -0.0493301 0.1258439 0.0595366 0.0416329 0.0656187 0.1149922 0.0815443 -0.0175713 -0.0445311 -0.032445 0.1739258 0.0188374 -0.0342858 0.0202192 0.1428575 0.1168357 0.0382668 0.0183043 -0.0011999 0.1133073 0.033397 0.0327511 0.0124098 -0.0470303 -0.032901 0.0507052 -0.0762568 0.0326707 0.0841995 -0.0147024 -0.09594 0.0082681 0.0691728 0.025558 -0.080069 0.0387161 -0.054278 0.0339894 0.0149993 0.0172195 0.0447206 0.1337334 -0.0066894 0.0481563 0.0008389 0.0708582 0.0788548 0.0290294 -0.0159631 0.0167797 0.123257 0.1130163 0.0113397 -0.0872845 -0.0352717 0.1074471 -0.0134409 -0.0524416 0.003065 -0.0406065 0.1256577 0.0109542 0.0173127 -0.0240165 -0.0614353 -0.0361359 0.0281656 -0.0676412 0.0713347 unknown
polarizability: 175.4286732|26.5562046|125.490863|6.8122614|-16.004814|112.8154078 unknown
InChI: InChI=1S/C9H9NO7/c1-5(11)15-9(16-6(2)12)7-3-4-8(17-7)10(13)14/h3-4,9H,1-2H3
charge 0 multiplicity 1
26 atoms
O  1.331679 0.838756 -0.378199
O  -1.647373 1.037677 0.230003
O  -1.496252 -1.287157 0.668755
O  -3.284921 0.320627 -1.279897
O  -1.414323 -2.62721 -1.256323
O  4.73414 1.695309 0.355018
O  3.388052 2.287361 -1.413451
N  3.61377 1.675666 -0.300205
C  -0.882412 -0.182066 -0.075496
C  0.507178 0.031639 0.424155
C  1.201129 -0.397058 1.550509
C  2.556496 0.900185 0.29295
C  2.523755 0.160801 1.468582
C  -2.874895 1.182376 -0.48072
C  -1.810081 -2.461441 -0.091054
C  -3.533914 2.48261 -0.097169
C  -2.657137 -3.388814 0.740501
H  -0.926497 -0.40086 -1.160698
H  0.798583 -1.032597 2.33467
H  3.347103 0.045721 2.168172
H  -3.754674 2.488298 0.984426
H  -4.464376 2.609773 -0.668138
H  -2.85125 3.326466 -0.295704
H  -3.704962 -3.037742 0.71364
H  -2.330789 -3.385285 1.792529
H  -2.61513 -4.405935 0.32464
