program: Gaussian 09
title: 000007096
version: EM64L-G09RevD.01
frameworkgroup: C1[X(C10H14N2)]
method: RPBEPBE
basis: SDD
operation: Freq
keyword: #pfreq=noraman
keyword: PBEPBE/SDD
title: #p freq=noraman PBEPBE/SDD
converged: YES YES NO NO
title: Mulliken charges:
elementType: N N C C C C C C C C C C H H H H H H H H H H H H H H
charge: -0.189155 -0.295297 -0.340010 -0.348691 -0.408966 -0.426028 0.466935 -0.379179 -0.378531 -0.225245 -0.232916 -0.269613 0.218338 0.203210 0.212556 0.211980 0.190614 0.211059 0.213033 0.190370 0.270320 0.215482 0.230652 0.217641 0.217078 0.224363
chargesum: 0.00000
title: Mulliken charges with hydrogens summed into heavy atoms:
elementType: N N C C C C C C C C C C
charge: -0.189155 -0.024977 0.081538 0.075845 -0.007293 -0.022625 0.466935 -0.163697 -0.147879 -0.007604 -0.015838 -0.045250
polarizability: 1.73452186e+02 7.16134404e-02 1.19212815e+02 1.98688927e+00 -4.42925525e+00 6.99952575e+01
1716.lowfreq: -14.6883 -13.9735 -0.0002 0.0005 0.0007 1.0433 53.4473 56.9094 136.0147
frequency: 53.4088 56.9043 136.0109 218.3690 246.7596 275.0512 303.8754 379.3541 408.4007 424.4181 452.6305 482.4547 514.9539 592.4581 613.6621 682.2187 690.5703 714.5333 756.2176 812.1352 842.7665 865.5404 871.5488 929.2953 935.7290 955.2910 975.0313 977.3737 1028.7284 1044.1888 1050.8979 1071.4854 1086.5330 1096.6330 1145.1121 1167.5878 1171.4647 1198.4047 1203.1898 1235.2304 1245.2161 1287.7638 1319.0030 1332.0296 1340.3976 1358.5204 1370.8091 1382.7298 1390.4403 1444.4373 1446.0749 1455.0822 1457.1069 1462.2531 1469.5680 1494.1451 1577.8113 1617.5077 2870.7148 2876.3101 2915.1940 2926.6136 3041.2165 3044.6837 3058.7350 3095.1666 3119.9065 3126.2442 3146.6410 3156.1318 3167.7680 3465.3847
redmass: 3.5412 3.3024 3.6257 3.1747 1.9087 3.1779 4.7421 1.8925 2.9218 3.5533 2.9198 2.0240 2.7783 2.8485 6.2651 1.6102 1.8051 4.0861 1.8945 1.2803 1.5297 2.9079 1.5794 2.4914 2.6253 1.3779 1.2978 5.3046 2.2997 2.2634 1.7389 1.8285 1.6814 2.2137 2.2734 2.1527 1.3045 1.1330 1.1067 1.4595 1.4619 1.2775 1.3064 1.3016 1.3384 1.7606 1.7690 3.6016 1.4301 1.9241 1.5715 1.1124 1.0795 1.1152 1.1111 2.3898 5.9648 6.0842 1.0713 1.0695 1.0685 1.0706 1.0895 1.0913 1.0911 1.0898 1.0842 1.0882 1.0924 1.0939 1.0999 1.0754
irintensity: 0.4807 1.4045 0.9918 4.8447 3.9893 10.4721 2.2668 1.0552 1.1008 1.9414 1.4013 70.4073 11.5312 37.7703 1.0483 60.4421 52.4405 5.3044 79.0335 0.8506 0.6058 2.0597 5.6769 19.7682 23.1824 0.0874 0.3629 8.5504 25.8576 12.4153 0.8537 2.1552 4.2859 16.0993 25.0887 16.9474 3.6533 3.4994 5.8223 141.6914 20.1979 11.0772 23.4370 14.8149 3.7939 17.8720 31.0412 14.1691 2.0253 2.3938 1.6271 6.9102 1.0994 58.6526 2.9141 118.9393 10.0836 150.4929 64.6700 119.0712 63.4149 106.8592 53.0934 53.6865 26.7230 20.1957 9.1318 7.9972 38.7645 42.0295 7.8058 1.3447
temp: 298.150 k
press: 1.00000 atm
elementType: 7 7 6 6 6 6 6 6 6 6 6 6 1 1 1 1 1 1 1 1 1 1 1 1 1 1
symmnumber: 1
zpe: 586935.9 jmol-1
zpe.correction: 0.223552 hartree
zpe.thermalcorrener: 0.233873 hartree
zpe.thermalcorrenthalpy: 0.234818 hartree
zpe.thermalcorrgfe: 0.187327 hartree
zpe.sumelectzpe: -498.039614 hartree
zpe.sumelectthermal: -498.029293 hartree
zpe.sumelectthermalent: -498.028349 hartree
zpe.sumelectthermalfe: -498.075840 hartree
dipole: 2.2548 0.1251 -0.4884
dipole: 2.3105
quadrupole: -65.2301 -64.5638 -77.8924
quadrupole: 0.6685 -3.2889 -0.4256
quadrupole: 3.9987 4.6650 -8.6637 0.6685 -3.2889 -0.4256
hfenergy: -498.2631661 hartree
pointgroup: C01 [X(C10H14N2)]
dipole: -0.885689 0.0660301 0.1937008 debye
dipolederiv: -1.7033124 0.0105962 -0.0429351 0.1395951 -0.4156003 -0.0078468 0.406923 0.0132382 -0.3628337 -0.3989331 -0.0322432 -0.1292458 -0.0514804 -0.5295423 -0.0042564 -0.2256102 -0.0042882 -0.5907509 0.3336978 -0.2072275 0.1348307 -0.4741639 0.2937253 -0.0872097 0.060138 -0.0971431 0.3941026 0.2540846 0.2121506 0.0105051 0.4565712 0.3877231 0.0736407 0.019109 0.1093611 0.3087382 0.2253305 0.2102947 0.0435009 0.1458862 0.4063041 0.0791475 -0.000471 0.0545341 0.3475212 0.2321569 -0.1653941 0.1436981 -0.1515819 0.3544277 -0.0809607 0.0559829 -0.0681427 0.4334977 1.7353611 -0.0143286 0.0169145 -0.0333477 -0.0722029 0.0582061 -0.0759747 0.0311948 0.0863303 -0.4511434 0.0334618 -0.0105219 -0.3969469 0.0128614 0.0233925 0.0013232 0.043918 -0.2098976 -0.4582667 -0.0482119 -0.0064916 0.4193895 -0.0139814 0.0417153 -0.0253745 0.037784 -0.2266931 0.2401659 -0.0801143 -0.0018 0.0164695 0.1805 0.0482116 0.0034516 0.0411105 -0.1357689 0.2333676 0.0872633 0.012237 -0.0319551 0.1774176 0.0408654 -0.0124544 0.0409287 -0.1354795 -0.1459368 -0.0088049 -0.0041274 0.0084762 -0.265393 -0.0041684 0.0010569 -0.0196234 -0.225575 -0.042468 0.0620635 -0.0298792 0.1093408 0.0270896 -0.077533 -0.1519143 0.050946 -0.2186022 0.0385641 -0.1101659 -0.0004826 -0.0760257 -0.082981 0.0042313 -0.0160599 -0.0276735 0.0708858 0.0400485 0.1031386 -0.0629826 0.0394627 -0.0518662 0.0676158 -0.0624949 0.0680505 0.0145667 -0.0237688 -0.0421305 0.0143806 -0.1420227 -0.0328566 -0.0424876 -0.0665896 -0.1544447 -0.1772652 0.0236767 -0.0892344 -0.02742 -0.0567043 -0.0502724 -0.0460807 0.003976 -0.1800987 -0.2313986 -0.0459045 0.0966347 -0.0531369 0.080815 -0.0948052 0.0752213 -0.0895989 0.1061212 0.0278701 -0.054365 -0.105639 -0.0002991 -0.1127441 -0.140435 0.0139787 -0.0441236 -0.016847 0.0757669 0.0208934 0.0628409 -0.0656042 0.0515859 0.0031817 -0.078177 -0.0198038 0.0646807 -0.2890197 -0.0068864 0.0164103 0.0715131 0.0570556 0.1034799 0.0446981 0.2308919 0.0393473 0.2701355 0.0296094 0.1083999 0.0187294 0.1015386 -0.057944 -0.0300712 0.0333432 -0.0326183 0.1490545 0.0413822 -0.098814 -0.0211582 -0.1009961 -0.0490521 -0.0324338 -0.0220698 -0.038164 0.1530199 0.0190971 -0.0932997 -0.0149716 -0.1161613 -0.0868706 -0.0358767 -0.0282608 -0.0293936 0.1470126 0.0168815 0.0908886 0.010132 0.1169119 -0.0880447 -0.0315993 0.0268759 -0.0268266 0.1484416 -0.1533323 0.0014651 -0.0053851 0.0010319 0.0851372 -0.012223 -0.0022712 -0.0059513 0.1763407 unknown
polarizability: 173.4643669|-0.4512921|119.521895|1.5348898|2.1070736|69.6739961 unknown
InChI: InChI=1S/C10H14N2/c1-2-4-10(5-3-1)12-8-6-11-7-9-12/h1-5,11H,6-9H2
charge 0 multiplicity 1
26 atoms
N  -0.706482 0.018671 0.04247
N  -3.569541 -0.00313 -0.131913
C  -1.447219 1.135674 -0.598058
C  -1.447361 -1.260436 0.002743
C  -2.854162 1.282362 0.007931
C  -2.864846 -1.08545 0.583808
C  0.711759 0.00523 0.009412
C  1.459801 1.212599 0.177017
C  1.449148 -1.208779 -0.146003
C  2.86762 1.199171 0.191711
C  2.860566 -1.210176 -0.118845
C  3.587608 -0.011137 0.047473
H  -1.552585 0.944186 -1.69014
H  -0.893428 2.07751 -0.468764
H  -0.91352 -2.005607 0.617148
H  -1.52457 -1.650616 -1.038417
H  -2.748304 1.603556 1.073931
H  -3.405211 2.068122 -0.540279
H  -3.422586 -2.031284 0.457552
H  -2.764637 -0.881274 1.678913
H  -4.564299 0.060328 0.115958
H  0.941885 2.16505 0.328699
H  0.928953 -2.156249 -0.313316
H  3.407122 2.143634 0.330437
H  3.393048 -2.160618 -0.24377
H  4.682343 -0.016337 0.063201
