program: Gaussian 09
title: 000007095
version: EM64L-G09RevD.01
frameworkgroup: C1[X(C12H10)]
method: RPBEPBE
basis: SDD
operation: Freq
keyword: #p
keyword: freq=noraman
keyword: PBEPBE/SDD
title: #p freq=noraman PBEPBE/SDD
converged: YES YES NO YES
title: Mulliken charges:
elementType: C C C C C C C C C C C C H H H H H H H H H H
charge: 0.270837 0.270837 -0.382662 -0.382672 -0.382705 -0.382694 -0.217343 -0.217349 -0.217334 -0.217336 -0.240570 -0.240565 0.244539 0.244537 0.244539 0.244539 0.226252 0.226255 0.226251 0.226251 0.228197 0.228195
chargesum: 0.00000
title: Mulliken charges with hydrogens summed into heavy atoms:
elementType: C C C C C C C C C C C C
charge: 0.270837 0.270837 -0.138123 -0.138135 -0.138166 -0.138154 0.008909 0.008906 0.008917 0.008915 -0.012373 -0.012370
polarizability: 1.75960389e+02 -6.29495430e-04 9.25237192e+01 1.14237191e-03 9.06787970e-06 9.25179327e+01
1716.lowfreq: -59.7268 -0.0006 0.0004 0.0009 9.7236 9.7264 18.7382 90.1678 90.1701
frequency: -59.7268 90.0925 90.0948 291.7723 291.7813 292.7733 396.1433 397.8529 535.0726 535.0764 607.2964 615.7133 615.7142 705.0759 705.0770 732.4338 767.4208 767.4253 850.3162 855.1225 917.8678 917.8726 971.8170 973.3299 985.9062 987.6895 993.6295 993.6306 996.7396 1026.5516 1046.1128 1077.3899 1077.3918 1171.1741 1171.1741 1186.1786 1186.2961 1285.5232 1308.4080 1308.4104 1368.3593 1368.3603 1428.0213 1428.0262 1465.8009 1496.4212 1583.5134 1583.5183 1606.6212 1617.8171 3121.0617 3121.2851 3127.3664 3127.3737 3139.0134 3139.7949 3148.4720 3148.4810 3163.0107 3163.6875
redmass: 3.7471 4.2274 4.2274 3.8591 3.8591 6.2574 2.8517 2.8061 3.2585 3.2585 6.9336 6.2172 6.2172 1.7218 1.7218 5.6947 1.9174 1.9174 1.2479 1.2371 1.4052 1.4052 1.3900 1.3788 6.1774 6.2687 1.3078 1.3078 6.9306 2.1932 1.7379 1.5959 1.5959 1.0527 1.0527 1.1122 1.1183 2.7565 1.3681 1.3681 6.9785 6.9786 2.2094 2.2095 2.0671 2.8387 6.0196 6.0196 6.0815 6.4125 1.0843 1.0843 1.0877 1.0877 1.0923 1.0926 1.0969 1.0969 1.1018 1.1018
irintensity: 0.0000 0.7585 0.7584 0.0268 0.0267 0.0000 0.0000 0.0000 14.0957 14.0943 5.0125 0.0263 0.0263 53.6766 53.6685 0.0000 47.3768 47.3691 0.0000 0.0000 2.0016 2.0014 0.0000 0.0000 0.0234 0.0000 0.1047 0.1046 15.5322 0.0000 8.0232 7.7026 7.7012 0.0265 0.0265 1.5219 0.0003 0.0000 0.4930 0.4927 0.1324 0.1324 7.0863 7.0856 38.1391 0.0000 1.3684 1.3682 13.0581 0.0000 3.5617 0.0002 0.3053 0.3014 37.8095 0.0012 41.0920 41.0948 45.8188 0.0001
temp: 298.150 k
press: 1.00000 atm
elementType: 6 6 6 6 6 6 6 6 6 6 6 6 1 1 1 1 1 1 1 1 1 1
symmnumber: 1
zpe: 466970.4 jmol-1
zpe.correction: 0.177860 hartree
zpe.thermalcorrener: 0.186252 hartree
zpe.thermalcorrenthalpy: 0.187196 hartree
zpe.thermalcorrgfe: 0.143990 hartree
zpe.sumelectzpe: -462.456759 hartree
zpe.sumelectthermal: -462.448367 hartree
zpe.sumelectthermalent: -462.447423 hartree
zpe.sumelectthermalfe: -462.490629 hartree
dipole: 0.0000 0.0001 0.0000
dipole: 0.0001
quadrupole: -60.0873 -68.5865 -68.5878
quadrupole: -0.0002 0.0003 0.0000
quadrupole: 5.6666 -2.8326 -2.8339 -0.0002 0.0003 0.0000
hfenergy: -462.6346188 hartree
pointgroup: C01 [X(C12H10)]
dipole: -0.0000028 -0.0000108 0.0000262 debye
dipolederiv: 0.3480215 0.0000263 0.0000083 0.000017 -0.0257089 -0.0381598 0.0000058 -0.0381824 -0.0461521 0.3480212 0.0000387 -0.0000054 0.0000276 -0.0461563 0.0381783 -0.0000014 0.0381609 -0.0257097 -0.1813652 -0.0535766 0.0410229 -0.0205644 -0.0121004 -0.0919403 0.0156636 -0.0918715 -0.0616078 -0.1813625 -0.0410336 -0.0535701 -0.0156683 -0.0616229 0.0918697 -0.0205615 0.0919447 -0.0120678 -0.1813539 0.0535495 -0.0410136 0.0205421 -0.0120634 -0.0919612 -0.0156394 -0.0918873 -0.0616024 -0.1813545 0.0410022 0.0535572 0.0156464 -0.0616036 0.0918837 0.0205307 0.091954 -0.0120739 -0.0178314 0.0547069 -0.0418836 0.0441661 -0.0004895 -0.1129303 -0.0337005 -0.1128534 -0.0613623 -0.017832 0.0418845 0.0547051 0.0337137 -0.0613847 0.1128466 0.0441594 0.1129172 -0.0004901 -0.0178027 -0.0547163 0.0419004 -0.0441892 -0.0005216 -0.1129105 0.0337306 -0.1128367 -0.0613758 -0.0178121 -0.0418907 -0.0547211 -0.0337194 -0.0613922 0.1128337 -0.0441856 0.1129118 -0.0004932 0.0847711 0.0000108 0. 0.0000181 -0.1129744 -0.0440054 -0.0000038 -0.0440731 -0.1365699 0.0847792 0.0000083 0.0000083 0.0000106 -0.1365732 0.0440724 0.0000094 0.0440037 -0.1129654 0.0565015 0.0766125 -0.0587147 0.073816 0.0235534 0.0867267 -0.0565347 0.086665 0.0702546 0.0565067 0.058703 0.0766159 0.0565239 0.0702709 -0.0866638 0.0738199 -0.0867332 0.0235209 0.0565387 -0.0765968 0.0586968 -0.0737964 0.0235143 0.0867534 0.0565126 0.0866891 0.0702487 0.0565316 -0.0586976 -0.0766046 -0.0565147 0.0702546 -0.086681 -0.0738 -0.0867451 0.0235216 0.0013378 -0.0715127 0.0547932 -0.0867978 0.0090879 0.111135 0.0664414 0.1110887 0.0689561 0.0013369 -0.0547937 -0.0715085 -0.0664409 0.068973 -0.1110799 -0.0867962 -0.1111286 0.0090848 0.0013037 0.0715172 -0.0548095 0.0868041 0.0091161 0.1111204 -0.0664597 0.1110715 0.0689643 0.00131 0.0547951 0.0715254 0.0664438 0.0689827 -0.1110698 0.0868132 -0.1111168 0.0090912 -0.1501199 -0.0000227 0.0000055 -0.0000244 0.1145851 0.0365921 0.000007 0.0366119 0.1342489 -0.1501255 -0.0000143 -0.000008 -0.0000138 0.1342533 -0.0366099 -0.0000109 -0.0365904 0.1145793 unknown
polarizability: 175.9603884|0.0041343|92.5180264|0.0006577|-0.0007298|92.5236256 unknown
InChI: InChI=1S/C12H10/c1-3-7-11(8-4-1)12-9-5-2-6-10-12/h1-10H
charge 0 multiplicity 1
22 atoms
C  -0.751145 0.000015 -0.000075
C  0.751172 0.000079 -0.000072
C  -1.474438 -0.969294 0.743177
C  1.474499 0.743264 0.969235
C  -1.474664 0.969154 -0.743248
C  1.474659 -0.743024 -0.969316
C  -2.888397 -0.970111 0.743705
C  2.88847 0.743821 0.969987
C  -2.888642 0.969698 -0.743668
C  2.888631 -0.743414 -0.969932
C  -3.600212 -0.000268 0.000038
C  3.600237 0.000241 0.000045
H  -0.926437 -1.722708 1.320613
H  0.926552 1.320633 1.722744
H  -0.926891 1.722702 -1.32073
H  0.926828 -1.32047 -1.722846
H  -3.431993 -1.725512 1.322552
H  3.432087 1.322623 1.725402
H  -3.432414 1.7250 -1.322479
H  3.43237 -1.32216 -1.725307
H  -4.696127 -0.000376 0.00008
H  4.696154 0.000306 0.000097
