program: Gaussian 09
title: 000007094
version: EM64L-G09RevD.01
frameworkgroup: C1[X(C12H22)]
method: RPBEPBE
basis: SDD
operation: Freq
keyword: #p
keyword: freq=noraman
keyword: PBEPBE/SDD
title: #p freq=noraman PBEPBE/SDD
converged: YES YES NO NO
title: Mulliken charges:
elementType: C C C C C C C C C C C C H H H H H H H H H H H H H H H H H H H H H H
charge: -0.008569 -0.008570 -0.465905 -0.466698 -0.465905 -0.466699 -0.407860 -0.408264 -0.407860 -0.408264 -0.380238 -0.380238 0.190459 0.190459 0.189222 0.209037 0.209667 0.189504 0.189222 0.209037 0.209667 0.189504 0.193594 0.189501 0.189448 0.193616 0.193594 0.189501 0.189448 0.193616 0.196724 0.186762 0.196725 0.186762
chargesum: 0.00000
title: Mulliken charges with hydrogens summed into heavy atoms:
elementType: C C C C C C C C C C C C
charge: 0.181889 0.181889 -0.067646 -0.067528 -0.067646 -0.067528 -0.024764 -0.025200 -0.024764 -0.025200 0.003249 0.003249
polarizability: 1.48020348e+02 -1.68747727e-05 1.18966375e+02 -7.68952252e-02 -1.18467701e-05 1.02137157e+02
1716.lowfreq: -14.3731 -0.0002 0.0004 0.0004 14.5007 20.8031 32.2427 75.1928 134.8903
frequency: 32.2396 75.1916 134.8361 152.3620 215.9179 216.3990 261.7092 285.1352 336.6738 354.3025 394.2996 420.8717 434.0996 446.0008 464.6515 493.6923 581.9586 777.3293 778.2556 781.1903 790.6441 841.6537 845.7530 866.8876 887.4216 890.2571 896.2840 909.9536 922.4395 949.6429 983.2186 1048.1293 1048.8312 1052.0309 1059.1333 1068.5197 1080.0493 1085.7281 1094.5274 1111.8467 1118.2827 1160.5832 1171.7953 1202.2643 1203.6222 1251.9997 1254.7712 1255.9002 1256.1612 1261.3026 1276.6826 1300.2082 1307.3317 1309.5965 1323.8095 1327.5250 1335.3452 1337.0675 1337.5529 1339.2261 1341.4502 1346.6892 1352.3301 1372.5917 1455.9917 1459.7462 1460.9185 1461.4338 1463.1677 1463.6815 1468.4355 1469.3625 1476.8250 1479.0353 2911.9655 2925.4829 2948.8211 2949.0725 2954.4015 2958.8788 2960.9712 2961.1843 2961.4606 2961.6329 2964.0034 2964.4342 3019.7065 3020.9694 3021.4272 3022.0397 3027.7025 3028.5923 3032.6593 3038.4080 3039.4177 3043.5171
redmass: 2.6555 2.8155 2.3685 3.4056 1.7461 1.7802 4.4680 1.8585 1.6507 3.3204 1.8282 3.0559 2.9697 2.3064 2.0818 1.6400 1.7784 1.4480 2.0164 1.4879 2.9661 1.5575 2.3704 2.3425 1.3488 1.5312 1.6948 2.0873 2.0817 2.4654 1.9920 1.5050 1.2008 1.5299 2.1712 1.2020 1.3523 1.7635 2.5071 2.3415 2.4289 2.5714 1.2713 1.5882 1.5150 1.2868 1.2850 1.2932 1.2923 1.1851 1.2585 1.3418 1.1547 1.2691 1.4566 1.4037 1.6487 1.3795 1.4734 1.4565 1.5250 1.5184 1.4648 1.4412 1.0887 1.0886 1.0868 1.0899 1.0892 1.0897 1.0796 1.0825 1.0985 1.0937 1.0788 1.0820 1.0661 1.0650 1.0668 1.0669 1.0611 1.0597 1.0608 1.0593 1.0649 1.0662 1.0970 1.0994 1.0959 1.0953 1.1004 1.0982 1.1003 1.0943 1.1022 1.0970
irintensity: 0.0033 0.0053 0.0001 0.0669 0.2296 0.0000 0.0000 0.3117 0.0000 0.0001 0.0822 0.0001 0.0838 0.8050 0.0000 0.0001 1.9678 0.0003 0.0004 0.1724 0.0049 11.7115 0.0000 4.0535 0.0015 24.0806 0.0258 0.0542 0.0001 0.0013 15.8675 0.3968 0.1314 0.1833 0.0000 0.0077 0.0018 4.7336 0.0006 0.0000 0.0082 0.0002 1.1731 0.0017 0.3963 0.0000 0.3135 10.4752 3.2798 0.0003 3.5446 0.0036 1.6361 0.0238 0.0016 0.3840 0.0000 0.5174 0.0022 0.0037 6.1002 2.6261 5.1450 0.0008 2.5237 0.0009 0.0012 15.3931 12.5959 0.0040 0.0069 36.5900 0.0005 5.8916 0.0010 13.2130 36.4921 0.0079 0.0027 80.5924 6.4563 116.2275 57.9827 4.2235 74.1368 0.0082 0.0084 135.4985 176.4978 0.0041 0.1676 13.7600 0.0003 85.1752 272.4244 0.0011
temp: 298.150 k
press: 1.00000 atm
elementType: 6 6 6 6 6 6 6 6 6 6 6 6 1 1 1 1 1 1 1 1 1 1 1 1 1 1 1 1 1 1 1 1 1 1
symmnumber: 1
zpe: 826556.8 jmol-1
zpe.correction: 0.314819 hartree
zpe.thermalcorrener: 0.326623 hartree
zpe.thermalcorrenthalpy: 0.327567 hartree
zpe.thermalcorrgfe: 0.277063 hartree
zpe.sumelectzpe: -469.502627 hartree
zpe.sumelectthermal: -469.490823 hartree
zpe.sumelectthermalent: -469.489879 hartree
zpe.sumelectthermalfe: -469.540383 hartree
dipole: 0.0000 -0.0010 0.0000
dipole: 0.0010
quadrupole: -78.2835 -77.6439 -76.1172
quadrupole: 0.0000 0.0584 0.0000
quadrupole: -0.9353 -0.2957 1.2310 0.0000 0.0584 0.0000
hfenergy: -469.8174462 hartree
pointgroup: C01[X(C12H22)]
dipole: 0. 0.0003752 -0.0000004 debye
polarizability: 148.0204101|0.0002133|118.9663747|0.055329|0.0000633|102.1370951 unknown
InChI: InChI=1S/C12H22/c1-3-7-11(8-4-1)12-9-5-2-6-10-12/h11-12H,1-10H2
charge 0 multiplicity 1
34 atoms
C  0.743289 -0.001228 0.245609
C  -0.743289 -0.001239 -0.245574
C  1.515549 -1.266584 -0.223306
C  1.513896 1.269814 -0.209745
C  -1.515528 -1.26661 0.223334
C  -1.513916 1.269789 0.209788
C  2.99725 -1.26809 0.224621
C  2.995888 1.267591 0.237415
C  -2.997229 -1.268136 -0.224593
C  -2.995909 1.267544 -0.237372
C  3.736964 0.00256 -0.249288
C  -3.736964 0.002499 0.249324
H  0.726784 -0.007001 1.360487
H  -0.726782 -0.007005 -1.360452
H  1.469975 -1.317857 -1.332907
H  1.024327 -2.180901 0.158286
H  1.022373 2.179133 0.183248
H  1.467243 1.334353 -1.318621
H  -1.469953 -1.317888 1.332934
H  -1.024291 -2.180915 -0.158264
H  -1.022409 2.179117 -0.183201
H  -1.467265 1.334323 1.318664
H  3.504105 -2.176123 -0.157353
H  3.042112 -1.319562 1.332809
H  3.040934 1.307723 1.346072
H  3.50186 2.179955 -0.135295
H  -3.50407 -2.17618 0.157373
H  -3.04209 -1.319601 -1.332781
H  -3.040957 1.307682 -1.346028
H  -3.501895 2.179899 0.135344
H  4.78245 0.001365 0.116591
H  3.783517 0.008127 -1.358309
H  -4.78245 0.001288 -0.116553
H  -3.783517 0.008058 1.358345
