program: Gaussian 09
title: 000047840
version: EM64L-G09RevD.01
frameworkgroup: C1[X(C13H18ClNO2)]
method: RPBEPBE
basis: SDD
operation: Freq
keyword: #p
keyword: freq=noraman
keyword: PBEPBE/SDD
title: #p freq=noraman PBEPBE/SDD
converged: YES YES NO NO
title: Mulliken charges:
elementType: Cl O O N C C C C C C C C C C C C C H H H H H H H H H H H H H H H H H H
charge: -0.068260 -0.304159 -0.254768 -0.621627 0.003809 0.329258 0.406796 0.238763 -0.724345 -0.705327 -0.701047 -0.706651 -0.392701 -0.372581 -0.208041 -0.223406 -0.110526 0.242402 0.209023 0.248443 0.224295 0.213665 0.268598 0.229529 0.223722 0.209046 0.213962 0.220140 0.266847 0.281935 0.296492 0.299554 0.263230 0.252884 0.251049
chargesum: 0.00000
title: Mulliken charges with hydrogens summed into heavy atoms:
elementType: Cl O O N C C C C C C C C C C C C C
charge: -0.068260 -0.304159 -0.254768 -0.043201 0.003809 0.329258 0.406796 0.238763 -0.024477 0.001231 -0.038750 -0.005703 -0.093147 -0.109351 0.044843 0.027643 -0.110526
polarizability: 2.09279510e+02 -8.91461330e+00 1.63269154e+02 -1.00331460e+01 -9.68553998e+00 1.16078665e+02
1716.lowfreq: -3.5843 -0.0005 0.0004 0.0015 3.0343 10.3165 27.0001 31.1667 53.2281
frequency: 26.9262 31.1602 53.2170 75.7190 116.6257 125.6193 147.1131 175.1187 180.9326 208.2303 215.4744 228.7435 247.0925 255.1854 259.9805 287.5720 293.7139 326.0129 329.7204 343.9969 364.8173 401.9920 414.7720 416.6485 436.8733 447.4990 495.6731 521.8939 541.2995 625.8035 647.0965 708.1087 711.6899 730.7992 742.2064 770.9164 803.7836 835.5293 847.9060 853.1674 916.7346 921.6386 950.9363 954.0553 967.3933 996.3397 998.7948 1003.7475 1027.8900 1031.6664 1064.3299 1070.6042 1097.4682 1124.3531 1164.4041 1177.6003 1195.8758 1222.0592 1258.0773 1272.7202 1286.6158 1296.6483 1367.9572 1374.7637 1376.7281 1384.7379 1389.6346 1399.1718 1445.5400 1463.9536 1464.5764 1466.6479 1471.0446 1471.6105 1474.5983 1481.2647 1502.4928 1583.8257 1592.3271 1604.9600 1653.2450 2989.7616 2990.1738 2990.4775 2995.7652 3081.4265 3084.1850 3084.8853 3094.8834 3098.1100 3115.8960 3119.6419 3129.1381 3145.9910 3153.2518 3167.4916 3171.8932 3430.3418 3556.3178
redmass: 4.4533 3.5534 3.8774 5.5511 5.7889 3.6502 4.5588 5.3032 1.0575 1.9728 1.9205 1.8633 1.0785 1.0877 1.2363 2.7303 5.2157 3.4193 3.2303 3.1937 4.7609 2.8042 3.0107 3.2439 2.5303 3.5315 3.8538 3.8222 3.9679 7.1057 4.0020 4.5102 6.5155 3.3053 2.1633 4.9066 3.2478 1.3626 1.5607 2.5572 1.5838 1.6212 2.2362 1.2042 1.3615 1.3453 3.5027 1.6557 1.4254 1.4266 2.3153 2.6747 1.4553 2.9008 2.3356 1.2006 2.6056 3.7383 3.0559 3.0705 1.3294 1.8850 5.8193 1.2251 1.2328 1.6685 2.0314 1.2147 1.0468 1.2264 1.2302 1.0631 1.1882 1.0672 1.2315 1.0519 1.0583 7.8400 6.7589 8.7495 1.0960 1.0385 1.0355 1.0365 1.0368 1.0993 1.0991 1.0979 1.0992 1.1002 1.1001 1.0993 1.0987 1.0881 1.0882 1.0959 1.0969 1.0458 1.0955
irintensity: 0.2261 0.0306 0.6458 0.4890 0.4928 0.8722 0.6694 0.5813 0.0150 21.5730 2.6810 11.1801 0.0136 0.1854 14.6250 2.2300 1.6232 1.7522 14.4241 3.7930 20.1596 1.8119 0.6974 5.2490 1.8042 18.7957 3.5346 9.7277 23.0022 0.3602 29.7947 32.1636 9.1256 50.3787 151.9665 61.2427 4.2111 24.6383 27.8220 20.3615 0.8217 1.1169 13.6518 0.2389 2.8499 3.4256 49.7279 11.9175 0.0694 0.2807 229.5931 21.5991 19.0898 216.5955 33.0775 9.5161 3.1581 26.3188 27.2857 14.6190 0.5485 10.9918 1.6052 40.4715 37.4477 12.2420 12.7026 27.8613 0.7642 13.8681 26.7985 5.8422 49.2583 22.4266 33.8599 3.6519 28.7197 2.3576 19.2485 150.1371 47.3418 23.7482 10.3562 30.4629 25.8103 8.0499 19.9785 28.1302 62.9407 32.5167 4.1104 14.5552 12.1852 1.2296 0.7076 5.8274 5.7109 2.8575 6.4951
temp: 298.150 k
press: 1.00000 atm
elementType: 17 8 8 7 6 6 6 6 6 6 6 6 6 6 6 6 6 1 1 1 1 1 1 1 1 1 1 1 1 1 1 1 1 1 1
symmnumber: 1
zpe: 745365.0 jmol-1
zpe.correction: 0.283895 hartree
zpe.thermalcorrener: 0.302591 hartree
zpe.thermalcorrenthalpy: 0.303536 hartree
zpe.thermalcorrgfe: 0.236988 hartree
zpe.sumelectzpe: -1170.156506 hartree
zpe.sumelectthermal: -1170.137809 hartree
zpe.sumelectthermalent: -1170.136865 hartree
zpe.sumelectthermalfe: -1170.203413 hartree
dipole: -4.1637 -0.2965 1.4406
dipole: 4.4158
quadrupole: -110.9180 -100.8158 -112.1488
quadrupole: 6.8791 -4.0247 -0.0800
quadrupole: -2.9572 7.1451 -4.1879 6.8791 -4.0247 -0.0800
hfenergy: -1170.4404008 hartree
pointgroup: C01 [X(C13H18Cl1N1O2)]
dipole: 1.5380096 0.1504326 -0.793832 debye
polarizability: 203.9497526|17.3477441|155.4637774|-19.0890829|18.5135933|129.2137985 unknown
InChI: InChI=1S/C13H18ClNO2/c1-12(2,3)17-11(16)13(4,15)9-5-7-10(14)8-6-9/h5-8H,15H2,1-4H3
charge 0 multiplicity 1
35 atoms
Cl -5.063461 -1.775696 0.492493
O  1.767923 -0.070739 -0.683164
O  1.944513 0.523092 1.574292
N  0.143857 2.619293 1.227749
C  0.155539 1.561418 0.20016
C  2.923013 -1.089049 -0.654617
C  -1.131758 0.694587 0.29575
C  1.388493 0.621142 0.452852
C  0.226205 2.226675 -1.199146
C  2.579238 -2.214926 0.339096
C  2.935701 -1.592809 -2.10711
C  4.227486 -0.351288 -0.297369
C  -2.198489 1.104955 1.129833
C  -1.285388 -0.482708 -0.481856
C  -3.397593 0.35968 1.198514
C  -2.477427 -1.23762 -0.428081
C  -3.517084 -0.802984 0.416234
H  -0.645839 2.891926 -1.320829
H  1.151484 2.824115 -1.305345
H  0.21466 1.470581 -1.997626
H  1.602284 -2.667884 0.0940
H  3.350133 -3.004384 0.272284
H  2.549528 -1.838922 1.373372
H  3.111136 -0.758483 -2.807844
H  1.974662 -2.070571 -2.365301
H  3.741658 -2.336794 -2.238161
H  5.079785 -1.047889 -0.39884
H  4.39369 0.495855 -0.986223
H  4.200998 0.024525 0.737048
H  0.704212 3.434785 0.957669
H  0.43142 2.263582 2.149167
H  -2.076263 2.027367 1.704913
H  -0.472253 -0.815492 -1.135047
H  -4.219938 0.681004 1.844625
H  -2.595228 -2.143046 -1.030693
