program: Gaussian 09
title: 000047884
version: EM64L-G09RevD.01
frameworkgroup: C1[X(C16H22N2O5)]
method: RPBEPBE
basis: SDD
operation: Freq
keyword: #p
keyword: freq=noraman
keyword: PBEPBE/SDD
title: #p freq=noraman PBEPBE/SDD
converged: YES YES NO NO
title: Mulliken charges:
elementType: O O O O O N N C C C C C C C C C C C C C C C C H H H H H H H H H H H H H H H H H H H H H H
charge: -0.299788 -0.252090 -0.265244 -0.295823 -0.262320 -0.090164 -0.436857 0.008865 0.297784 0.237685 0.046824 0.032212 0.138855 -0.272766 -0.363818 -0.358766 -0.187410 -0.613799 -0.614175 0.220611 -0.522501 -0.515058 -0.776600 0.260760 0.213571 0.202038 0.206440 0.262531 0.318000 0.263472 0.226475 0.190025 0.223355 0.225008 0.190436 0.227046 0.224118 0.281605 0.200019 0.223398 0.230135 0.257452 0.252284 0.212398 0.253775
chargesum: 0.00000
title: Mulliken charges with hydrogens summed into heavy atoms:
elementType: O O O O O N N C C C C C C C C C C C C C C C C
charge: -0.299788 -0.252090 -0.265244 -0.295823 -0.262320 -0.090164 -0.118857 0.008865 0.297784 0.237685 0.046824 0.032212 0.138855 0.201564 0.044660 -0.096235 0.076062 0.026056 0.028316 0.220611 0.183241 0.195928 -0.058142
polarizability: 2.69870268e+02 -9.03965164e+00 2.61039187e+02 -1.04868513e+01 -3.80387542e-01 1.27573430e+02
1716.lowfreq: -5.7420 -2.6738 0.0002 0.0007 0.0008 3.7032 24.4395 28.8883 33.4624
frequency: 24.3257 28.7818 33.0968 39.5918 52.3044 65.7795 71.8840 81.7481 90.7693 101.2677 116.9988 127.1913 146.6881 151.5586 173.1919 186.6199 191.6627 201.7839 219.4756 225.4085 226.8071 248.6024 257.7998 285.1440 298.2782 311.7380 312.8213 335.2636 347.3403 379.6896 419.1627 455.7279 471.5022 480.5460 503.7997 534.3394 564.9195 580.4357 587.8501 604.1485 645.3886 674.5846 680.0924 734.9867 749.6116 773.5010 805.9666 820.4070 850.3644 856.6179 871.7016 901.2789 917.8951 935.8251 970.1979 991.0650 997.3304 1027.0637 1034.5218 1036.1982 1038.5092 1065.0896 1083.9099 1088.1793 1093.5098 1104.2689 1113.6008 1117.4025 1133.3959 1138.2317 1156.4423 1161.6737 1164.0207 1216.5139 1239.7602 1248.0641 1267.9206 1288.3937 1302.1485 1321.7799 1343.3778 1356.4967 1383.7781 1389.0172 1411.7085 1418.7266 1421.2870 1437.3738 1443.6859 1448.3818 1450.7716 1457.9554 1461.7100 1462.7673 1467.9295 1469.8108 1475.3255 1477.0420 1477.3330 1481.4220 1486.3203 1493.5012 1497.2763 1529.1178 1589.8107 1609.6828 1637.2737 2852.5180 2861.4014 2884.6185 2985.0290 2985.6448 2993.0631 3005.6578 3020.0720 3028.4480 3033.0762 3078.6995 3084.0976 3086.8897 3091.8410 3094.5547 3102.5237 3115.1318 3129.1235 3131.0502 3231.3211 3268.5158 3510.7131
redmass: 3.7488 3.5958 2.7303 3.1071 4.3104 3.6880 1.5957 1.6074 2.1612 3.8013 1.2832 2.2649 3.2062 2.5978 3.7428 3.3875 2.7399 2.2016 1.2841 3.1049 3.8702 1.3927 4.5808 4.7342 4.1516 4.5607 4.3715 4.4000 3.4577 3.5666 2.4176 3.8118 5.1061 6.3738 4.7231 6.1575 4.4972 3.0138 5.7279 1.5336 5.1909 8.4449 5.0953 1.7375 4.2495 5.4462 1.5488 2.3220 5.3105 1.4506 6.6799 5.9716 8.4041 6.0607 4.2304 3.6620 2.2191 4.9002 2.1747 1.6271 1.6937 1.6186 3.2876 1.6411 1.8469 1.3060 1.2862 2.5060 1.6928 1.4237 1.3920 1.5427 1.4957 3.3463 1.8063 2.5625 2.5300 1.2513 2.0590 1.6709 6.4953 2.8764 1.2237 1.8239 2.6793 1.3026 1.2727 1.3367 1.1661 1.1129 1.0886 1.0616 1.0599 2.2584 1.0643 1.2088 1.0734 1.0619 1.0662 1.0887 1.0553 1.0869 2.1600 5.3455 9.3917 8.8681 5.8350 1.0567 1.0585 1.0678 1.0315 1.0316 1.0367 1.0625 1.0729 1.0769 1.0851 1.1011 1.0988 1.1008 1.1017 1.0997 1.1023 1.0991 1.1043 1.1050 1.0916 1.1078 1.0751
irintensity: 0.0839 1.1791 0.5831 5.2900 0.3051 6.1508 2.1508 1.1638 0.9701 6.2379 0.2495 2.2344 1.2738 4.6530 3.0213 3.9000 10.9364 5.3589 1.5062 0.8120 2.7673 1.7944 7.0785 4.7925 9.9246 7.5121 6.4411 5.8061 7.1004 0.3799 0.0903 15.1873 5.4802 2.1677 23.6894 10.6725 4.8417 1.2860 10.1677 62.4651 5.9051 0.6531 10.6608 45.7089 2.7474 29.7759 10.3034 13.7870 7.2376 4.5683 16.3417 22.7680 13.0865 21.7111 70.9986 0.7725 54.7392 175.5586 124.6744 31.8055 24.6961 2.8683 54.0970 17.8416 7.1485 1.1120 16.7587 102.9080 14.7817 8.7718 8.7304 18.2584 14.8969 38.8783 13.6509 87.3348 10.8638 2.3837 21.8223 89.3734 98.7106 53.0291 49.6570 14.6289 89.3595 16.9683 7.6268 7.9902 3.3544 73.5636 13.6734 21.2556 32.8051 339.3349 4.6661 48.2012 13.9889 8.0611 13.3738 11.1365 12.1347 14.2895 152.5663 7.1711 18.0679 26.5045 155.9028 67.0749 157.8484 125.5250 71.7737 79.6727 12.2713 38.0503 42.0002 46.3036 22.7262 25.4095 17.6413 57.2165 29.0578 22.0088 23.0606 12.8901 18.6484 15.9256 2.2410 0.2096 43.3354
temp: 298.150 k
press: 1.00000 atm
elementType: 8 8 8 8 8 7 7 6 6 6 6 6 6 6 6 6 6 6 6 6 6 6 6 1 1 1 1 1 1 1 1 1 1 1 1 1 1 1 1 1 1 1 1 1 1
symmnumber: 1
zpe: 946882.1 jmol-1
zpe.correction: 0.360648 hartree
zpe.thermalcorrener: 0.385986 hartree
zpe.thermalcorrenthalpy: 0.386931 hartree
zpe.thermalcorrgfe: 0.303512 hartree
zpe.sumelectzpe: -1106.691853 hartree
zpe.sumelectthermal: -1106.666515 hartree
zpe.sumelectthermalent: -1106.665571 hartree
zpe.sumelectthermalfe: -1106.748989 hartree
dipole: -2.3075 -1.7588 0.1188
dipole: 2.9038
quadrupole: -115.8900 -122.6319 -142.6902
quadrupole: -12.6169 -4.8559 -8.1798
quadrupole: 11.1807 4.4388 -15.6195 -12.6169 -4.8559 -8.1798
hfenergy: -1107.0525017 hartree
pointgroup: C01 [X(C16H22N2O5)]
dipole: 0.7479476 -0.8625426 0.0422047 debye
polarizability: 273.2955128|5.6373679|257.113465|-9.3709247|-9.751449|128.0739066 unknown
InChI: InChI=1S/C16H22N2O5/c1-10(19)17-12-13(20-4)11-6-8-22-14(11)16(21-5)15(12)23-9-7-18(2)3/h6,8,17H,7,9H2,1-5H3
charge 0 multiplicity 1
45 atoms
O  1.557216 0.111405 -0.193197
O  -2.494747 -2.708035 0.539813
O  -2.748506 2.060598 0.8285
O  0.497669 -2.554935 -0.072975
O  -1.435507 3.437563 -1.330552
N  5.032775 -0.790644 0.874865
N  0.045521 2.275804 0.077922
C  0.193582 -0.144803 0.056956
C  -2.571501 -0.386164 0.554079
C  -0.630085 1.029194 0.191685
C  -1.742719 -1.522243 0.356927
C  -2.015511 0.92046 0.474952
C  -0.357254 -1.452215 0.095885
C  2.568901 -0.620187 0.628576
C  3.934189 -0.094787 0.165574
C  -3.890066 -0.903187 0.894298
C  -3.807101 -2.276462 0.869997
C  6.267395 0.015809 0.95363
C  5.29709 -2.146687 0.349316
C  -0.364408 3.387352 -0.662225
C  -3.90199 2.401461 -0.040534
C  -0.035855 -3.696023 -0.849486
C  0.595706 4.574026 -0.583706
H  2.451516 -1.701813 0.461271
H  2.403677 -0.394136 1.699073
H  4.003023 -0.197968 -0.945715
H  3.996824 0.985249 0.394642
H  -4.774221 -0.324568 1.150237
H  1.038589 2.228831 0.323681
H  -4.519423 -3.076318 1.051456
H  6.052195 0.985093 1.437169
H  6.73269 0.220105 -0.044337
H  7.014418 -0.513757 1.572021
H  6.049199 -2.647941 0.984214
H  5.679469 -2.138643 -0.703398
H  4.378092 -2.756364 0.373188
H  -4.372018 3.27294 0.439818
H  -3.52549 2.671771 -1.03961
H  -4.624776 1.566387 -0.097446
H  -0.376192 -3.358358 -1.846103
H  0.8143 -4.386844 -0.954064
H  -0.86678 -4.184607 -0.314816
H  0.652414 5.054123 -1.573567
H  1.61189 4.29776 -0.251171
H  0.191207 5.317057 0.127455
