program: Gaussian 09
title: 000007093
version: EM64L-G09RevD.01
frameworkgroup: C1[X(C10H14ClN)]
method: RPBEPBE
basis: SDD
operation: Freq
keyword: #p
keyword: freq=noraman
keyword: PBEPBE/SDD
title: #p freq=noraman PBEPBE/SDD
converged: NO YES NO NO
title: Mulliken charges:
elementType: Cl N C C C C C C C C C C H H H H H H H H H H H H H H
charge: -0.071636 -0.170713 -0.390393 -0.395025 0.455571 -0.582279 -0.661086 -0.367299 -0.362634 -0.237223 -0.238645 -0.269133 0.245365 0.247052 0.219590 0.224663 0.291496 0.264482 0.241721 0.219177 0.215410 0.226474 0.228083 0.219341 0.220755 0.226885
chargesum: 0.00000
title: Mulliken charges with hydrogens summed into heavy atoms:
elementType: Cl N C C C C C C C C C C
charge: -0.071636 -0.170713 0.102024 0.049228 0.455571 -0.026301 0.015223 -0.140825 -0.134551 -0.017882 -0.017890 -0.042248
polarizability: 1.71183426e+02 -8.90921137e+00 1.33607013e+02 9.40357404e+00 9.58273618e+00 7.41233529e+01
1716.lowfreq: -12.8845 -5.7226 -0.0028 -0.0025 -0.0023 7.3948 37.8934 52.9839 67.3056
frequency: 37.3293 52.8724 67.2910 95.6864 131.7196 185.2517 208.9578 227.9868 256.2234 288.4476 384.1789 390.1103 419.3108 501.7559 526.7040 539.1676 614.4163 667.6556 691.4892 728.7850 753.1112 784.0677 789.9686 808.3805 866.0909 893.9800 954.1724 974.5348 974.9712 991.9825 1014.5286 1033.0692 1039.9838 1076.5164 1093.9755 1106.0243 1170.2418 1173.1130 1204.7839 1214.7714 1250.0101 1271.6146 1291.9963 1335.6148 1346.7381 1354.7973 1380.2873 1384.1314 1389.8215 1449.5768 1456.8558 1465.7338 1479.4683 1490.0522 1496.2427 1509.0233 1578.1339 1620.5845 2984.3686 2993.3888 3011.9161 3042.0376 3063.5651 3069.3920 3080.3124 3094.7727 3122.8386 3128.7357 3149.4907 3153.1081 3158.6525 3170.8492
redmass: 4.7868 5.1858 3.7084 2.8613 2.4385 2.7287 1.4252 3.2418 4.2164 2.7484 3.5377 2.8273 2.9435 2.8018 3.0095 3.8857 6.3647 5.7421 1.7891 4.1728 1.9060 1.1210 1.1773 1.2538 1.4923 2.3191 1.3702 2.5111 1.7459 2.8074 1.5911 2.8966 2.5994 2.0037 1.7025 1.4847 1.7642 1.0668 1.1233 2.2486 1.1641 1.3940 1.2008 1.3262 1.3206 1.3611 5.4271 1.2653 1.7487 2.1987 1.1597 1.0518 1.0612 1.0899 1.8197 1.3145 5.9922 6.0716 1.0357 1.0606 1.0604 1.1024 1.0588 1.1016 1.0998 1.1007 1.0846 1.0886 1.1108 1.0927 1.0938 1.1001
irintensity: 0.4265 0.9681 0.3462 0.0067 1.2376 1.6052 4.2595 7.3308 1.5115 0.4241 9.7634 3.5279 0.1532 14.7126 0.9853 8.4050 0.4497 81.1249 39.9720 16.5534 83.8972 6.6122 10.7927 0.1299 5.1091 0.7040 0.0518 1.1053 0.9248 19.9539 1.5100 6.6524 10.9512 10.4501 0.2087 31.5692 25.6092 1.1776 8.3731 51.1189 19.8563 41.6103 6.8327 1.8784 24.9651 39.2714 6.2059 22.5345 39.4268 3.2101 11.1429 10.2942 2.0088 28.2204 102.1399 82.6255 10.8514 184.7006 26.9173 43.8135 19.9466 10.7290 16.1017 12.2268 43.7672 39.5081 9.4753 9.3664 17.1100 28.9616 42.4204 6.0063
temp: 298.150 k
press: 1.00000 atm
elementType: 17 7 6 6 6 6 6 6 6 6 6 6 1 1 1 1 1 1 1 1 1 1 1 1 1 1
symmnumber: 1
zpe: 572459.3 jmol-1
zpe.correction: 0.218038 hartree
zpe.thermalcorrener: 0.230390 hartree
zpe.thermalcorrenthalpy: 0.231334 hartree
zpe.thermalcorrgfe: 0.177984 hartree
zpe.sumelectzpe: -903.353903 hartree
zpe.sumelectthermal: -903.341551 hartree
zpe.sumelectthermalent: -903.340607 hartree
zpe.sumelectthermalfe: -903.393957 hartree
dipole: 0.8803 2.3423 0.5502
dipole: 2.5620
quadrupole: -88.3629 -73.3266 -82.0849
quadrupole: -3.5829 0.6154 2.6070
quadrupole: -7.1047 7.9315 -0.8268 -3.5829 0.6154 2.6070
hfenergy: -903.5719413 hartree
pointgroup: C01 [X(C10H14Cl1N1)]
dipole: 0.1303357 -0.9767805 -0.211929 debye
dipolederiv: -0.6819565 0.272573 0.0227506 0.3761658 -0.3782186 -0.0060825 0.1378432 -0.0741155 -0.2130895 -1.6232313 -0.2380295 -0.0163661 -0.1826612 -0.8120839 0.087118 -0.1309897 0.0441742 -0.3270255 0.5425222 -0.1562881 -0.0270967 -0.4020227 0.2403028 0.0210369 0.0494986 -0.1422454 0.1827013 0.1430942 0.093836 0.0124529 0.1896325 0.7952304 -0.0180619 0.083809 0.0633977 0.2614981 1.5835063 0.5451387 0.0204376 0.6858894 0.1221045 -0.0635118 0.0422988 -0.0666713 0.0933317 0.7171991 -0.3430845 -0.0953909 -0.3969986 0.388185 0.0775254 -0.2021979 0.1893486 0.1445146 0.0459049 0.0228309 -0.0168704 -0.031163 -0.1228072 0.0813109 -0.038439 0.119261 -0.0497482 -0.5329036 -0.2229604 -0.0492166 0.1829223 0.0496958 0.0367188 0.102176 0.1091615 -0.2147372 -0.2645534 -0.0485928 0.0105586 -0.5096082 -0.1671268 0.066225 -0.1534511 0.0185467 -0.2121415 0.2187024 0.1186828 -0.0053885 0.0044378 0.1979914 0.1123168 -0.0298096 0.0826833 -0.1051105 0.2629209 -0.0705191 -0.0788752 0.0712918 0.1352162 0.0809033 -0.027272 0.087222 -0.1031701 -0.1674301 0.0639457 0.0136848 0.0398037 -0.2607722 -0.0259954 0.0063148 -0.0204547 -0.2331773 -0.079135 -0.0765033 0.0558241 -0.0729281 -0.0098987 0.0737856 0.0186784 0.0612222 0.063899 0.0553928 -0.0108357 -0.0698442 0.0680934 -0.0133111 -0.1029806 -0.0301091 -0.0552077 -0.0424203 -0.1508101 -0.0462721 -0.1125822 -0.0172298 0.0111476 0.0347875 -0.0623437 0.026956 0.0525479 0.0387957 0.082768 0.1428167 -0.0021626 -0.0283446 -0.0067686 0.0732401 -0.0279173 -0.0848351 -0.0194972 -0.0458379 0.0891613 -0.0113672 -0.020698 0.0272742 0.0668365 0.0108542 0.0593073 -0.0115869 0.0360677 -0.0169781 -0.0073057 -0.0052101 -0.1188883 -0.0295133 -0.0714929 -0.0318582 -0.1041905 0.0214465 -0.086914 -0.0097397 0.1141721 -0.0041295 -0.0562256 -0.0109675 0.0607694 -0.0073061 0.0085865 0.1217572 0.0597597 0.0852158 -0.0466308 0.0997788 -0.0037761 -0.0595085 0.0878434 -0.0489477 -0.0172616 -0.0767744 -0.2009431 -0.0545342 -0.0190887 -0.0758476 0.0509969 0.0919796 -0.0394819 -0.0057036 -0.0404778 -0.1103053 -0.0599143 -0.0105647 -0.0677556 0.1402087 -0.0516538 0.0967746 0.044511 0.1045943 0.0302131 -0.0402192 0.0489908 -0.0450169 0.1388354 -0.0596417 0.0905969 0.053124 0.1132363 0.0159904 -0.0536929 0.0565662 -0.0518636 0.1290753 0.078902 -0.0240068 0.0008173 -0.0514448 -0.1138802 -0.0736082 -0.0048305 -0.0748382 0.1294834 -0.1128674 -0.0818876 0.0105917 -0.0839429 0.0581345 -0.0239842 0.0088038 -0.0246572 0.1696528 unknown
polarizability: 173.0815187|-0.1147653|131.7292621|-7.7416191|11.1169304|74.1030109 unknown
InChI: InChI=1S/C10H14ClN/c1-2-12(9-8-11)10-6-4-3-5-7-10/h3-7H,2,8-9H2,1H3
charge 0 multiplicity 1
26 atoms
Cl -3.985055 2.014016 0.037074
N  -0.79077 -0.641961 -0.015272
C  -1.93816 0.130833 0.481218
C  -1.052006 -2.03248 -0.44205
C  0.513221 -0.103752 -0.008151
C  -2.525809 1.010031 -0.639694
C  -0.826622 -3.076905 0.677204
C  1.645011 -0.895649 -0.381319
C  0.755461 1.255975 0.367393
C  2.943553 -0.34805 -0.38151
C  2.061381 1.785021 0.369899
C  3.17169 0.995149 -0.00576
H  -2.718251 -0.562671 0.842529
H  -1.65242 0.761546 1.341962
H  -2.101012 -2.088974 -0.788269
H  -0.426469 -2.271714 -1.322102
H  -1.803496 1.747962 -1.016782
H  -2.9349 0.411651 -1.467217
H  0.213194 -3.046417 1.045374
H  -1.494962 -2.881568 1.53513
H  -1.035457 -4.096676 0.303818
H  1.519828 -1.944938 -0.663016
H  -0.072407 1.911663 0.653523
H  3.786412 -0.985788 -0.673172
H  2.20755 2.831139 0.663613
H  4.183096 1.413456 -0.005422
