program: Gaussian 09
title: 000046698
version: EM64L-G09RevD.01
frameworkgroup: C1[X(C19H29NOS)]
method: RPBEPBE
basis: SDD
operation: Freq
keyword: #p
keyword: freq=noraman
keyword: PBEPBE/SDD
title: #p freq=noraman PBEPBE/SDD
converged: YES YES NO NO
title: Mulliken charges:
elementType: S O N C C C C C C C C C C C C C C C C C C C H H H H H H H H H H H H H H H H H H H H H H H H H H H H H
charge: 0.117329 -0.258470 0.312001 -0.384686 -0.385712 -0.386068 -0.381459 -0.380279 -0.373318 -0.376674 -0.353039 -0.406437 -0.356829 -0.322021 -0.696324 0.360135 -0.309788 -0.348294 -0.389284 -0.361936 0.483224 -0.790596 0.194505 0.194688 0.193399 0.193603 0.193909 0.194598 0.192447 0.192116 0.196920 0.197214 0.189578 0.189507 0.194117 0.191873 0.187826 0.187705 0.218161 0.216909 0.194919 0.194634 0.210496 0.209779 0.209713 0.215330 0.209737 0.256436 0.259570 0.252593 0.256238
chargesum: 0.00000
title: Mulliken charges with hydrogens summed into heavy atoms:
elementType: S O N C C C C C C C C C C C C C C C C C C C
charge: 0.117329 -0.258470 0.312001 0.004507 0.001291 0.002439 0.003104 0.013856 0.005766 0.009317 0.022492 0.028633 0.032724 0.098255 -0.061544 0.360135 -0.053352 -0.088724 -0.136691 -0.105698 0.483224 -0.790596
polarizability: 4.45794542e+02 -2.84206918e+01 1.95126804e+02 -2.54886248e+00 -4.77715337e-01 1.42126756e+02
1716.lowfreq: -33.6645 -1.1729 -0.0016 0.0012 0.0020 2.4494 7.1901 12.6795 18.0870
frequency: -27.4768 9.6563 13.3056 23.6545 25.9134 42.7819 51.8750 55.6293 65.7060 88.5236 93.7834 99.4198 116.2258 119.9564 125.4555 144.3886 151.2040 158.4295 169.2551 187.7311 229.4572 230.2281 253.9914 315.0412 341.0455 358.1568 368.5367 403.6535 413.8201 420.4055 432.1907 437.1696 476.3218 490.9974 513.0071 522.5225 626.3438 636.8909 717.7836 720.4632 720.6894 726.5987 740.1541 763.4891 790.8894 795.5008 809.1273 835.5622 841.4435 887.3035 888.4207 899.5622 938.5483 942.8896 961.2091 962.1591 981.5831 988.8632 993.4065 999.0464 1019.3987 1028.0614 1036.4571 1055.5582 1071.8578 1077.4868 1080.1297 1081.9183 1099.5949 1112.1199 1125.7351 1147.5648 1173.5336 1181.0196 1201.5227 1203.7172 1223.6040 1227.9691 1233.3965 1253.0158 1260.7920 1270.5245 1273.7455 1277.2034 1282.4097 1287.2848 1289.0218 1289.8294 1296.1287 1298.8094 1299.3503 1312.9724 1333.9072 1348.4059 1352.1906 1354.0944 1355.7484 1359.1051 1382.2855 1389.4072 1432.8617 1458.4616 1458.5414 1462.0881 1462.3004 1465.6004 1468.0801 1470.9309 1475.2886 1477.3589 1479.6747 1483.7357 1487.0339 1488.5657 1496.6000 1565.4240 1619.5707 2195.5357 2946.7476 2948.3548 2948.6188 2950.4986 2951.1877 2953.8555 2955.4467 2960.3042 2965.1736 2967.4690 2971.7189 2981.5796 2984.8110 2989.3884 2994.9918 2995.1647 3002.9738 3005.8153 3013.7074 3024.8381 3034.7608 3042.3324 3063.6094 3068.3632 3070.1122 3152.8424 3155.2992 3172.3675 3177.3532
redmass: 1.8002 4.3695 6.3341 4.0944 6.6802 4.7385 4.2201 1.6530 4.8740 2.9007 1.9243 4.2402 5.0897 2.5594 1.8568 2.0761 2.0561 2.1584 3.9185 7.4230 1.1138 4.0652 4.4721 3.7409 5.9542 7.9180 5.6539 4.2453 3.0390 4.3173 9.9812 5.5459 3.3703 3.2983 3.5025 2.4468 7.6689 7.2283 1.0591 1.1135 3.2657 1.0830 1.1067 1.1356 6.7661 1.1873 1.2639 1.5313 1.2554 1.8609 1.2367 8.3667 1.2531 1.3061 7.9638 1.3402 4.5865 1.2757 3.6450 2.5430 3.8404 1.0904 3.3091 3.1588 2.6358 2.4873 2.0954 2.1537 2.5588 1.3087 3.1879 1.4007 1.1883 1.8459 1.4343 1.3816 2.9312 1.4044 1.3074 1.3102 1.3030 4.9450 1.2106 1.0344 1.0531 1.2963 1.1470 1.0857 1.0966 1.1271 1.3094 1.3457 1.4116 1.5529 1.7300 2.9697 1.9178 1.6509 1.5097 1.2172 4.0891 1.0737 1.0743 1.0662 1.0751 1.0754 1.0813 1.1014 1.1067 1.0424 1.1143 1.1217 1.1047 1.1712 1.9291 7.4308 6.3878 12.8843 1.0552 1.0585 1.0586 1.0590 1.0592 1.0591 1.0593 1.0591 1.0587 1.0585 1.0365 1.0963 1.0973 1.0987 1.0858 1.0734 1.1026 1.1063 1.1046 1.1052 1.1051 1.1047 1.1051 1.1007 1.0993 1.0882 1.0885 1.0966 1.0979
irintensity: 0.0074 0.3866 0.2988 0.1997 0.0946 0.0094 0.0354 0.0048 0.1172 0.6010 0.0270 0.1481 0.1099 0.6543 0.0248 0.9433 0.1099 0.9482 0.1719 3.0159 0.0012 1.3193 0.2028 0.5516 0.3629 0.0607 0.8387 0.1374 0.0420 0.4260 0.0066 1.5771 0.1329 0.2947 0.2815 22.4755 62.2636 19.8148 17.4887 0.9097 0.0161 7.4472 0.3552 4.6748 0.6767 2.0034 7.3766 73.3929 8.0959 5.1721 1.0945 62.1543 0.1188 1.2573 74.4824 0.0100 1.6168 4.2032 17.1548 6.6647 6.6393 0.3462 1.7096 4.3050 0.4030 2.5991 0.0550 0.2483 18.3351 14.4151 10.3862 1.0738 91.0438 0.0798 11.0708 17.7772 342.4810 0.5573 3.0984 0.0399 1.1708 72.5842 0.2143 0.0772 0.5490 2.3151 0.2895 0.0298 0.2589 0.0388 0.0510 0.2740 0.1996 0.6986 0.4370 6.0535 1.8857 1.3293 35.0290 11.3691 4.3791 0.0192 0.0252 0.0222 0.2521 0.0234 4.5728 21.1816 13.2493 12.3711 32.2265 15.4455 23.0482 83.8970 134.1387 11.8572 63.6168 1288.6802 24.0737 0.1882 0.1436 0.7504 0.3911 3.5366 7.1170 4.5384 65.6566 248.8032 38.5685 0.0241 0.1201 0.3919 13.2505 24.8798 2.9512 20.7880 0.0483 5.1545 2.5396 242.5949 98.8472 98.2155 55.7827 12.4080 7.5322 10.3923 1.3348
temp: 298.150 k
press: 1.00000 atm
elementType: 16 8 7 6 6 6 6 6 6 6 6 6 6 6 6 6 6 6 6 6 6 6 1 1 1 1 1 1 1 1 1 1 1 1 1 1 1 1 1 1 1 1 1 1 1 1 1 1 1 1 1
symmnumber: 1
zpe: 1148185.2 jmol-1
zpe.correction: 0.437321 hartree
zpe.thermalcorrener: 0.462358 hartree
zpe.thermalcorrenthalpy: 0.463302 hartree
zpe.thermalcorrgfe: 0.376456 hartree
zpe.sumelectzpe: -1267.751176 hartree
zpe.sumelectthermal: -1267.726138 hartree
zpe.sumelectthermalent: -1267.725194 hartree
zpe.sumelectthermalfe: -1267.812041 hartree
dipole: -5.9974 -0.2689 0.0831
dipole: 6.0040
quadrupole: -213.7117 -139.9078 -144.2997
quadrupole: 6.9931 0.3634 0.1208
quadrupole: -47.7386 26.0652 21.6734 6.9931 0.3634 0.1208
hfenergy: -1268.1884963 hartree
pointgroup: C01 [X(C19H29N1O1S1)]
dipole: -2.3606185 0.0707993 -0.0482966 debye
polarizability: 445.1023175|14.3677601|160.1519678|-27.9853605|-25.3138934|177.7938169 unknown
InChI: InChI=1S/C19H29NOS/c1-2-3-4-5-6-7-8-9-10-11-16-21-19-14-12-18(13-15-19)20-17-22/h12-15H,2-11,16H2,1H3
charge 0 multiplicity 1
51 atoms
S  11.139774 0.399942 -1.088628
O  2.973716 -0.823872 0.701188
N  8.384985 0.012538 -0.519214
C  -4.565754 -0.246998 0.384754
C  -5.806835 0.244392 -0.393945
C  -3.228819 0.092202 -0.312336
C  -7.139845 -0.067794 0.323124
C  -1.994521 -0.436344 0.452176
C  -8.385311 0.395079 -0.466245
C  -0.653044 -0.06104 -0.21722
C  -9.716193 0.098344 0.261291
C  0.567789 -0.628314 0.543267
C  -10.963441 0.548087 -0.533767
C  1.891813 -0.210616 -0.098108
C  -12.287561 0.254221 0.204326
C  4.296048 -0.5670 0.328274
C  4.683619 0.239144 -0.773556
C  5.287612 -1.178007 1.140282
C  6.051126 0.43124 -1.054184
C  6.648363 -0.987516 0.860603
C  7.044859 -0.177158 -0.243169
C  9.555283 0.180253 -0.758774
H  -4.636053 -1.345739 0.527851
H  -4.570953 0.199041 1.401371
H  -5.727525 1.339552 -0.558362
H  -5.815002 -0.221089 -1.401816
H  -3.146084 1.193241 -0.428588
H  -3.233175 -0.329544 -1.339286
H  -7.139169 0.415544 1.32259
H  -7.209309 -1.160513 0.507362
H  -2.007733 -0.040281 1.488898
H  -2.063811 -1.540518 0.540413
H  -8.393305 -0.099135 -1.460415
H  -8.310946 1.485421 -0.662472
H  -0.649105 -0.434862 -1.262482
H  -0.575049 1.044725 -0.279487
H  -9.713567 0.601152 1.251168
H  -9.787699 -0.990453 0.466978
H  0.515746 -1.733502 0.570573
H  0.5544 -0.279662 1.593742
H  -10.968081 0.041562 -1.520609
H  -10.888814 1.634931 -0.743147
H  1.95961 -0.569697 -1.146459
H  2.007141 0.893464 -0.090326
H  -12.319556 0.772889 1.181158
H  -13.16307 0.586505 -0.383522
H  -12.401548 -0.829366 0.397343
H  3.938414 0.717704 -1.414452
H  4.965663 -1.795963 1.983483
H  6.358295 1.052193 -1.901427
H  7.415023 -1.456682 1.484583
