program: Gaussian 09
title: 000046670
version: EM64L-G09RevD.01
frameworkgroup: C1[X(C13H11N3O2S)]
method: RPBEPBE
basis: SDD
operation: Freq
keyword: #p
keyword: freq=noraman
keyword: PBEPBE/SDD
title: #p freq=noraman PBEPBE/SDD
converged: YES YES NO NO
title: Mulliken charges:
elementType: S O O N N N C C C C C C C C C C C C C H H H H H H H H H H H
charge: 0.934422 -0.538223 -0.543438 -0.039629 -0.711470 -0.690961 0.453743 -0.108622 0.449761 -0.456129 -0.027352 -0.084539 -0.399383 -0.295634 -0.229350 -0.395590 -0.547920 0.542224 -0.434960 0.260394 0.292304 0.273063 0.278618 0.238510 0.261152 0.223737 0.337718 0.324150 0.319471 0.313934
chargesum: 0.00000
title: Mulliken charges with hydrogens summed into heavy atoms:
elementType: S O O N N N C C C C C C C C C C C C C
charge: 0.934422 -0.538223 -0.543438 -0.039629 -0.049602 -0.057556 0.453743 -0.108622 0.449761 -0.195735 -0.027352 -0.084539 -0.107079 -0.022570 0.049268 -0.157079 -0.286768 0.542224 -0.211223
polarizability: 4.30202318e+02 -1.83098817e+01 1.85633090e+02 1.21099010e+00 5.04157502e-01 9.44458000e+01
1716.lowfreq: 0.0009 0.0010 0.0024 2.2294 5.5873 12.2613 30.3752 41.2139 92.9254
frequency: 30.3537 41.1957 92.9235 97.3137 107.6626 132.2419 179.1081 188.2738 196.1426 257.0362 259.1054 265.0022 305.8368 317.2547 374.2404 377.7532 385.3994 394.6412 399.3319 441.6642 450.9837 461.1153 468.0642 478.4544 482.4967 497.9606 588.6766 610.0252 619.2980 650.7595 667.1884 728.1382 754.4633 773.8501 789.9071 794.0850 802.9348 811.8788 843.3464 844.1232 879.0776 893.4295 896.1219 910.2166 942.2703 946.1642 965.8938 981.4121 1041.4239 1045.5222 1069.1664 1129.9629 1146.8411 1188.6678 1202.9554 1236.7690 1253.5418 1273.3603 1329.7006 1336.7706 1359.0572 1398.5021 1415.2207 1445.1627 1467.4754 1497.8757 1523.2326 1533.4062 1548.9701 1590.9255 1605.5867 1642.6656 1654.3014 3118.5609 3123.7030 3137.2883 3142.8231 3152.0300 3156.8966 3177.1542 3362.8836 3531.2515 3560.1179 3700.3232
redmass: 6.6015 5.7552 7.4331 3.6354 3.8100 2.0483 4.0832 7.5440 5.8351 4.2834 4.7176 2.9387 4.9490 8.0914 4.4219 7.7650 2.0133 1.6155 3.0708 7.8147 1.3260 4.0411 2.6404 3.9360 3.1142 6.1540 3.6780 7.9143 7.4926 3.6040 6.2275 6.7699 2.9394 5.6894 2.1265 1.7549 6.8927 1.5714 2.1481 3.3564 1.8440 1.5099 4.2374 4.2227 1.5410 2.9433 1.4219 1.3501 2.2353 1.4466 1.4932 1.4787 1.4449 1.2678 2.4203 1.9923 1.6187 2.0955 3.2137 2.3685 3.1572 3.1854 7.4281 3.7292 4.9817 4.0392 6.8796 1.1091 7.3510 6.0980 6.9346 1.3677 3.8320 1.0864 1.0923 1.0921 1.0978 1.0924 1.0878 1.0981 1.0414 1.1000 1.0452 1.1040
irintensity: 0.5253 1.3910 0.0449 7.0964 6.9722 29.9459 8.9913 3.1369 8.5786 1.0882 0.8397 9.8382 2.1017 4.1987 5.2952 63.4026 25.0368 107.0425 1.1950 57.3005 148.8790 42.7649 4.8134 153.6456 54.7403 4.5098 29.0800 3.7228 20.0096 0.2409 8.2198 1.4477 0.0252 2.1256 4.4780 72.9571 198.8808 40.2271 18.3352 6.7408 39.0100 6.9367 11.4414 64.0400 34.5377 2.6437 7.0321 2.8556 61.2714 6.5291 26.1549 5.6568 14.4418 57.6014 26.4532 0.9086 14.0464 16.3934 35.4338 61.5422 0.9252 1.9081 28.2954 41.4685 4.5707 199.6671 19.4299 20.7097 26.8371 5.9869 267.9773 20.4885 542.1965 3.9884 7.0367 2.2505 30.7628 14.8366 2.5977 2.6081 28.6380 22.1286 182.9259 25.7146
temp: 298.150 k
press: 1.00000 atm
elementType: 16 8 8 7 7 7 6 6 6 6 6 6 6 6 6 6 6 6 6 1 1 1 1 1 1 1 1 1 1 1
symmnumber: 1
zpe: 571066.8 jmol-1
zpe.correction: 0.217508 hartree
zpe.thermalcorrener: 0.234423 hartree
zpe.thermalcorrenthalpy: 0.235367 hartree
zpe.thermalcorrgfe: 0.172907 hartree
zpe.sumelectzpe: -1213.260937 hartree
zpe.sumelectthermal: -1213.244022 hartree
zpe.sumelectthermalent: -1213.243078 hartree
zpe.sumelectthermalfe: -1213.305538 hartree
dipole: -8.0044 1.2423 3.0232
dipole: 8.6460
quadrupole: -83.3183 -112.4658 -124.5847
quadrupole: -4.5906 17.5448 2.6012
quadrupole: 23.4713 -5.6762 -17.7951 -4.5906 17.5448 2.6012
hfenergy: -1213.4784449 hartree
pointgroup: C01 [X(C13H11N3O2S1)]
dipole: -3.1733932 -0.4671641 -1.1323857 debye
polarizability: 430.7187843|13.4575683|184.9465465|-6.1163097|-2.6963893|94.6158767 unknown
InChI: InChI=1S/C13H11N3O2S/c14-10-2-1-8-5-9-6-11(19(15,17)18)3-4-12(9)16-13(8)7-10/h1-7H,14-15H2
charge 0 multiplicity 1
30 atoms
S  4.513888 -0.42124 0.057994
O  5.385646 0.688574 0.8697
O  4.528509 -2.0069 0.440393
N  -1.238037 1.453873 -0.060387
N  5.056348 -0.221724 -1.693433
N  -6.014077 0.607226 -0.028393
C  0.371657 -0.443914 0.027288
C  0.045731 0.981075 -0.036765
C  -2.033929 -0.904048 0.048912
C  -0.703787 -1.368567 0.071511
C  -2.268568 0.542394 -0.020525
C  2.721385 0.128671 0.002289
C  1.746515 -0.852255 0.04454
C  1.122937 1.939574 -0.06711
C  2.451393 1.529424 -0.047318
C  -3.174674 -1.782467 0.090704
C  -3.608167 1.032978 -0.046232
C  -4.701792 0.151125 -0.004864
C  -4.463972 -1.279216 0.064915
H  -0.497753 -2.444893 0.124386
H  2.022848 -1.911073 0.111531
H  0.851513 2.998458 -0.10343
H  3.277657 2.246558 -0.0507
H  -3.008447 -2.865034 0.143984
H  -3.747436 2.11763 -0.097802
H  -5.324156 -1.959142 0.097617
H  5.990865 0.220572 -1.673707
H  5.054784 -1.146724 -2.1547
H  -6.217656 1.601966 -0.075025
H  -6.795326 -0.041502 0.004528
