program: Gaussian 09
title: 000007092
version: EM64L-G09RevD.01
frameworkgroup: C1[X(C10H8O2)]
method: RPBEPBE
basis: SDD
operation: Freq
keyword: #pfreq=noraman
keyword: PBEPBE/SDD
title: #p freq=noraman PBEPBE/SDD
converged: YES YES NO NO
title: Mulliken charges:
elementType: O O C C C C C C C C C C H H H H H H H H
charge: -0.242949 -0.197575 0.379021 0.161758 0.445248 -0.579068 -0.341141 -0.327006 -0.248497 -0.806824 -0.304597 0.117718 0.242427 0.265485 0.240077 0.245893 0.234876 0.234707 0.226883 0.253562
chargesum: 0.00000
title: Mulliken charges with hydrogens summed into heavy atoms:
elementType: O O C C C C C C C C C C
charge: -0.242949 -0.197575 0.379021 0.161758 0.445248 -0.336641 -0.075656 -0.086929 -0.002604 -0.110357 -0.051035 0.117718
polarizability: 1.93663959e+02 -5.96712310e+00 1.11654582e+02 1.19772306e-02 2.61568759e-03 4.90302075e+01
1716.lowfreq: 0.0008 0.0010 0.0011 4.2281 14.5277 17.5729 50.4298 79.5924 159.3423
frequency: 50.3764 79.5890 159.3411 175.7145 229.8208 340.3895 344.8519 372.8235 404.1935 454.6200 469.4245 522.6536 558.9518 561.5322 659.9316 674.2345 728.7516 753.4155 803.3618 825.3525 836.0551 837.2292 898.3693 931.7627 967.0996 990.3288 1004.6381 1039.2546 1050.1950 1121.2559 1161.3161 1189.7892 1234.2954 1267.0388 1270.7640 1369.1090 1398.9865 1403.8425 1431.2568 1469.8306 1474.2402 1484.6212 1567.4644 1602.5719 1631.1728 1686.1259 2979.4790 3057.8670 3087.6667 3124.1148 3132.9858 3134.7305 3173.9066 3186.2989
redmass: 1.0688 5.0873 4.3078 4.8211 4.0237 4.3422 4.5190 3.7180 5.6351 3.0354 5.4028 6.7089 2.7944 7.2813 6.3430 3.7352 7.0226 3.9489 6.3641 1.4907 1.3921 6.0348 1.4722 3.3292 1.3360 1.3261 1.5021 3.1911 1.5497 1.9648 1.6056 1.3137 2.2550 2.5906 1.4557 1.9920 2.9146 1.6751 2.8716 1.0448 1.8303 1.6155 6.5889 6.7463 6.8622 10.6776 1.0375 1.0977 1.0988 1.0919 1.0901 1.0904 1.0955 1.0957
irintensity: 0.3241 1.2459 5.6632 1.4397 0.0814 2.1070 2.2320 0.4223 0.9339 6.2342 2.6747 6.7150 4.2170 4.7887 9.5764 0.1347 7.6738 8.6815 40.2768 1.5974 87.1999 38.4701 16.8869 0.5249 2.7424 0.3048 10.0455 60.1411 12.7832 20.5675 26.1155 1.3674 14.7938 19.2493 6.0221 4.6378 4.1326 6.6643 20.3110 13.8723 38.3725 1.2886 82.2550 8.7098 38.6451 539.9589 34.1885 18.7015 15.8407 11.7101 12.8948 10.6202 3.3116 2.7334
temp: 298.150 k
press: 1.00000 atm
elementType: 8 8 6 6 6 6 6 6 6 6 6 6 1 1 1 1 1 1 1 1
symmnumber: 1
zpe: 396950.8 jmol-1
zpe.correction: 0.151191 hartree
zpe.thermalcorrener: 0.161009 hartree
zpe.thermalcorrenthalpy: 0.161953 hartree
zpe.thermalcorrgfe: 0.115510 hartree
zpe.sumelectzpe: -535.481101 hartree
zpe.sumelectthermal: -535.471282 hartree
zpe.sumelectthermalent: -535.470338 hartree
zpe.sumelectthermalfe: -535.516781 hartree
dipole: 5.5624 2.7394 -0.0005
dipole: 6.2004
quadrupole: -77.6088 -61.3209 -72.0194
quadrupole: -9.0134 0.0029 -0.0015
quadrupole: -7.2925 8.9955 -1.7030 -9.0134 0.0029 -0.0015
hfenergy: -535.6322915 hartree
pointgroup: C01 [X(C10H8O2)]
dipole: 2.1678086 -1.117889 0.0408668 debye
dipolederiv: -1.3485728 0.0739834 -0.000879 -0.3675226 -0.3561231 0.0070074 0.0164668 0.0062468 -0.1969017 -1.4922297 0.167779 -0.0046837 0.5175887 -0.4827215 0.0048189 -0.0187266 0.0054448 -0.3394484 -0.3602464 -0.0804352 0.0038891 -0.2519278 -0.249957 0.0114459 0.0108415 0.0111395 0.0262626 0.7199847 -0.1816069 0.0059982 0.017748 0.1229703 -0.0006523 -0.0018718 -0.0001846 0.1083733 0.3605925 -0.122691 0.0042204 -0.3252272 -0.205792 0.0074871 0.011588 0.0073099 -0.0334806 0.1192865 0.1389783 -0.0060878 -0.0828074 0.1285264 -0.0115619 0.0027409 -0.0120727 -0.1663234 -0.2398829 0.0683716 -0.0025189 -0.0543171 0.093642 -0.0096972 0.0025697 -0.0100589 -0.1543249 -0.1234638 -0.0234194 0.0006892 0.2147533 0.1525934 -0.0128393 -0.0087968 -0.0125324 -0.1588254 0.6969006 0.0800619 -0.004695 0.2514168 0.2979488 -0.015383 -0.0113895 -0.0151335 -0.0753706 -0.1576097 0.0298442 -0.0008215 -0.0308907 0.0816461 -0.0005605 0.002951 -0.0008259 0.0672128 -0.5539977 0.0780656 -0.0025366 0.5627383 -0.1885393 -0.0007868 -0.0218079 0.000187 -0.1806641 2.1624407 -0.1689186 0.0036381 -0.4596676 0.7426822 -0.0176866 0.0154667 -0.0183085 0.2789596 0.0654072 0.0279727 -0.0010206 0.066271 -0.0830422 0.0092244 -0.0026405 0.0094594 0.1509473 0.0820552 0.0509279 -0.0018669 0.0235766 -0.0217995 0.0077438 -0.0007782 0.0077177 0.1731894 -0.0301365 -0.1064142 0.0045492 -0.0942738 0.0103064 0.0057139 0.0039315 0.0056555 0.1483721 0.0821749 0.0738511 -0.0028244 0.0001949 -0.0750724 0.0085913 0.000093 0.0084717 0.1396525 -0.0306542 0.0008219 0.0679556 -0.014581 0.0754224 0.0832757 0.1284375 0.051527 -0.0449445 -0.0308961 -0.0053851 -0.0676013 -0.0265288 0.0623471 -0.092885 -0.126705 -0.0609375 -0.0312578 0.0655577 -0.0321616 0.001482 0.094664 -0.1356797 0.0107292 -0.0042494 0.0108013 0.1099731 0.0132899 -0.0696256 0.003114 -0.0412078 0.0306415 0.0060149 0.0018793 0.0060936 0.1785987 unknown
polarizability: 193.858386|4.4107732|111.3601603|-0.4483868|-2.4901405|49.1302024 unknown
InChI: InChI=1S/C10H8O2/c1-7-2-4-9-8(6-7)3-5-10(11)12-9/h2-6H,1H3
charge 0 multiplicity 1
20 atoms
O  -1.518255 1.09555 -0.047303
O  -3.782426 0.638716 -0.02554
C  0.140795 -0.726234 0.021626
C  -0.188161 0.659521 -0.032661
C  2.540406 -0.136775 -0.00599
C  1.51519 -1.100613 0.034013
C  0.820867 1.644829 -0.073789
C  2.167676 1.241461 -0.060234
C  -0.951417 -1.676929 0.061816
C  4.005721 -0.533817 0.007784
C  -2.263249 -1.258559 0.047892
C  -2.634747 0.156226 -0.008042
H  1.76908 -2.167125 0.076254
H  0.534832 2.699648 -0.11531
H  2.954051 2.005033 -0.092034
H  -0.718176 -2.747548 0.104191
H  4.527176 -0.176025 -0.899664
H  4.531614 -0.097311 0.877447
H  4.129007 -1.629037 0.056067
H  -3.098982 -1.962212 0.077779
