program: Gaussian 09
title: 000047824
version: EM64L-G09RevD.01
frameworkgroup: C1[X(C26H26N2O2)]
method: RPBEPBE
basis: SDD
operation: Freq
keyword: #p
keyword: freq=noraman
keyword: PBEPBE/SDD
title: #p freq=noraman PBEPBE/SDD
converged: YES YES NO NO
title: Mulliken charges:
elementType: O O N N C C C C C C C C C C C C C C C C C C C C C C C C C C H H H H H H H H H H H H H H H H H H H H H H H H H H
charge: -0.417655 -0.230862 -0.509093 -0.041415 -0.365347 -0.384938 -0.371823 -0.577176 -0.374945 0.514871 -0.487658 0.240473 0.416350 -0.408131 -0.414981 0.231970 0.228866 -0.457608 -0.346853 -0.109896 -0.092696 -0.331181 -0.380895 0.171545 -0.312187 -0.309984 -0.268950 -0.265770 -0.238930 -0.235266 0.195487 0.196217 0.208611 0.209502 0.192943 0.193647 0.208340 0.206004 0.218853 0.217520 0.252461 0.252745 0.233336 0.234382 0.302504 0.229795 0.265417 0.268176 0.217658 0.264678 0.265553 0.229907 0.227829 0.231154 0.231872 0.375575
chargesum: 0.00000
title: Mulliken charges with hydrogens summed into heavy atoms:
elementType: O O N N C C C C C C C C C C C C C C C C C C C C C C C C C C
charge: -0.042081 -0.230862 -0.206589 -0.041415 0.026356 0.033175 0.014768 -0.162833 0.061428 0.514871 0.017548 0.240473 0.416350 -0.174795 -0.180599 0.231970 0.228866 -0.227813 -0.081436 -0.109896 -0.092696 -0.063006 -0.163237 0.171545 -0.047509 -0.044431 -0.039043 -0.037941 -0.007776 -0.003394
polarizability: 4.42048981e+02 4.60121914e+01 3.67119543e+02 -6.33366739e+01 1.88988764e+01 2.20050524e+02
1716.lowfreq: -4.9514 -0.0011 0.0009 0.0011 1.5913 4.6520 8.6681 12.4637 14.2915
frequency: 8.5805 12.3960 14.0130 32.3400 35.1865 41.1529 54.8873 63.6496 70.9069 82.7824 85.1943 112.2569 123.1728 128.9223 138.0274 155.6157 174.1922 210.1642 219.8987 243.1656 275.4117 282.4860 313.9464 328.7327 347.3186 380.0314 394.9750 402.3003 407.7161 422.9277 434.4017 475.6345 480.6684 492.8321 500.7462 506.3362 520.4555 528.2421 568.8860 583.1404 588.0247 592.1902 616.8650 636.0040 638.7751 638.9278 654.2905 699.6013 724.1956 730.3856 739.2370 746.3135 760.5141 770.7430 775.5996 785.1623 798.2343 823.1204 829.0011 838.8045 856.7101 858.4209 863.5065 867.3504 872.0129 879.5139 929.1496 944.3637 960.0494 963.1043 966.3843 969.0500 992.6498 993.0738 994.1728 1005.3083 1015.8195 1020.2744 1023.4080 1043.6525 1065.0522 1070.0071 1082.1966 1086.3825 1097.6917 1109.3672 1117.0430 1133.6660 1150.1736 1160.8977 1183.0960 1190.9567 1211.7376 1217.0300 1221.4874 1223.6564 1244.7412 1249.8794 1256.5215 1264.7070 1280.0244 1280.3380 1281.3248 1285.7879 1291.4488 1293.9725 1313.5784 1317.6231 1342.1181 1350.2404 1357.6567 1368.8822 1373.0765 1377.5653 1397.7382 1414.2003 1430.3676 1437.4229 1441.7771 1452.3254 1462.8110 1464.2025 1470.1523 1471.1929 1480.6693 1488.4360 1488.8485 1507.8667 1524.9194 1550.8651 1552.3339 1589.1463 1610.9685 1625.3461 1630.0554 1669.4124 2951.7690 2957.4350 2966.8901 2976.6753 2985.9575 2989.4009 2995.6018 3005.8417 3021.0161 3031.0696 3045.7656 3062.0774 3111.4767 3120.8640 3121.3800 3131.4326 3135.6148 3136.7735 3147.3928 3154.2639 3161.3929 3166.5044 3170.2212 3174.9405 3511.5342 3525.9059
redmass: 6.2888 8.8375 6.9635 4.4508 5.3560 3.1254 3.8495 2.0107 5.7273 3.3292 3.0078 4.1882 5.0655 2.0042 2.0737 5.0206 4.4968 4.9364 5.5242 4.7791 4.5791 4.2247 5.8483 3.4484 3.6396 3.9951 5.6612 3.6014 3.0015 3.2824 4.5028 2.8948 2.9745 1.7189 1.7965 3.2057 5.3873 3.0242 4.2032 3.8547 4.7053 6.4255 5.3996 6.0542 1.3133 5.7738 5.5419 4.8696 1.0817 3.6435 1.1362 3.4383 2.0400 1.4224 2.1167 1.2872 2.8425 4.7650 1.4198 1.6416 5.4306 4.7858 1.4110 2.2283 1.8206 2.6417 5.5925 1.4137 1.3617 1.3471 1.3567 1.3516 4.2543 1.3308 1.3238 2.9934 3.9645 2.2901 2.0330 2.7762 2.9101 1.4727 2.2164 3.5797 3.1596 2.0403 1.4210 1.2362 1.3356 1.1833 1.1892 1.1136 1.4786 1.2659 2.3053 1.4417 1.4647 3.0052 1.2937 2.3221 1.4765 1.7279 1.5108 1.8841 1.1130 1.0948 1.5014 1.5272 1.5236 2.3926 1.6348 2.4562 1.8275 4.1301 3.3113 3.4141 4.8941 1.0845 2.6449 3.0169 1.0785 1.0671 1.0947 2.2839 1.0998 2.8825 1.1158 2.9402 6.5853 6.3942 5.2202 4.7613 5.6652 6.4531 6.4045 8.2371 1.0590 1.0592 1.0591 1.0593 1.0612 1.0978 1.0595 1.1005 1.1026 1.0999 1.1048 1.1032 1.0870 1.0856 1.0893 1.0859 1.0965 1.0888 1.0898 1.0947 1.0948 1.0955 1.0996 1.0985 1.0639 1.0746
irintensity: 0.3250 0.9661 0.4053 0.1144 0.3172 0.1913 1.1422 0.0192 2.3273 0.3815 0.9104 0.0465 2.7086 0.0624 0.0878 1.0063 2.5046 0.5933 3.6647 1.0668 2.4046 3.9299 2.5188 12.3515 4.5085 3.0528 7.7617 9.5041 0.1520 20.5709 15.2743 3.9208 121.7682 75.3629 27.5369 6.5273 2.8047 5.2056 9.6325 7.7641 18.3377 2.7803 20.0014 8.1958 127.3874 6.3969 5.4527 13.2634 16.3360 5.1934 0.3883 5.9993 94.7953 7.7264 54.6312 4.9981 4.4938 9.8564 19.4005 31.0042 0.8056 2.2579 2.7052 4.7028 2.6133 0.9506 4.1538 0.0091 0.9140 0.6510 0.6763 2.2595 48.3221 0.0824 0.9292 3.4875 71.0614 1.8039 12.7339 157.7184 6.7674 1.0308 9.1311 10.9736 23.8497 0.3408 0.4657 16.3434 14.7400 0.0925 0.5803 3.9034 0.3075 35.2702 4.5843 0.9731 5.5105 13.6528 0.7190 23.0525 15.9603 6.2296 4.4033 2.0535 0.0989 0.0658 8.6395 14.4730 15.3963 25.2128 6.2276 9.3084 33.6435 134.8841 21.7100 3.0300 136.3921 28.0255 21.2486 5.2630 0.0156 0.3703 1.3773 13.0603 3.4207 196.3743 31.2316 342.4301 44.0398 86.7226 9.4537 13.7838 16.3593 48.3605 9.3472 209.2633 1.2064 28.4625 5.9970 93.0648 6.3121 0.2106 40.3812 6.1941 4.9865 0.0750 59.4918 86.2971 20.6530 2.3191 23.1575 6.5048 22.8195 13.9273 11.7269 23.3139 7.0195 15.2133 34.6908 21.4432 18.7170 15.8050
temp: 298.150 k
press: 1.00000 atm
elementType: 8 8 7 7 6 6 6 6 6 6 6 6 6 6 6 6 6 6 6 6 6 6 6 6 6 6 6 6 6 6 1 1 1 1 1 1 1 1 1 1 1 1 1 1 1 1 1 1 1 1 1 1 1 1 1 1
symmnumber: 1
zpe: 1195235.9 jmol-1
zpe.correction: 0.455241 hartree
zpe.thermalcorrener: 0.482454 hartree
zpe.thermalcorrenthalpy: 0.483398 hartree
zpe.thermalcorrgfe: 0.391747 hartree
zpe.sumelectzpe: -1264.222270 hartree
zpe.sumelectthermal: -1264.195057 hartree
zpe.sumelectthermalent: -1264.194113 hartree
zpe.sumelectthermalfe: -1264.285764 hartree
dipole: -2.0535 1.8680 1.6838
dipole: 3.2468
quadrupole: -200.3026 -165.3407 -170.8797
quadrupole: -7.5134 6.3709 5.9356
quadrupole: -21.4616 13.5003 7.9613 -7.5134 6.3709 5.9356
hfenergy: -1264.6775109 hartree
pointgroup: C01 [X(C26H26N2O2)]
dipole: -0.8621396 0.4863262 0.8074156 debye
polarizability: 434.8716793|65.4840499|358.1304856|-49.548982|49.6093629|236.2168833 unknown
InChI: InChI=1S/C26H26N2O2/c29-25(30)14-4-2-1-3-9-19-15-17-20(18-16-19)27-26-21-10-5-7-12-23(21)28-24-13-8-6-11-22(24)26/h5-8,10-13,15-18,27,29H,1-4,9,14H2
charge 0 multiplicity 1
56 atoms
O  -11.158873 1.157494 -0.978816
O  -10.668046 -1.109754 -0.896964
N  2.416057 0.262176 1.435864
N  5.849512 0.815202 -1.109046
C  -5.38208 -1.19451 0.029407
C  -3.947043 -0.677958 0.272731
C  -6.411263 -0.0586 -0.16496
C  -2.917235 -1.826837 0.462949
C  -7.844772 -0.582928 -0.400317
C  -1.504355 -1.320591 0.70829
C  -8.857597 0.561407 -0.592358
C  3.512873 0.420447 0.562993
C  1.13333 -0.288245 1.161341
C  -1.011952 -1.118166 2.022974
C  -0.64528 -0.987842 -0.371442
C  4.014505 -0.650535 -0.250761
C  4.202274 1.680923 0.548627
C  0.285768 -0.617942 2.2532
C  0.649174 -0.472916 -0.161641
C  5.173974 -0.378581 -1.097399
C  5.389519 1.811763 -0.288418
C  3.483384 -1.987619 -0.228719
C  3.764717 2.827508 1.299913
C  -10.273371 0.074529 -0.829871
C  5.679186 -1.428161 -1.944376
C  6.113956 3.055705 -0.27935
C  4.01555 -2.983635 -1.043868
C  4.486871 4.019538 1.278478
C  5.111982 -2.697861 -1.926969
C  5.683101 4.130588 0.491974
H  -5.693688 -1.82972 0.884942
H  -5.389184 -1.853318 -0.864078
H  -3.930851 -0.025257 1.169091
H  -3.628322 -0.043411 -0.579095
H  -6.398623 0.602151 0.727207
H  -6.100416 0.572569 -1.023874
H  -2.93887 -2.470507 -0.439012
H  -3.246032 -2.4588 1.311759
H  -7.863262 -1.242847 -1.288727
H  -8.159633 -1.213045 0.453615
H  -8.873745 1.233389 0.288302
H  -8.574173 1.204558 -1.449103
H  -1.64837 -1.368829 2.880737
H  -0.998411 -1.129182 -1.40064
H  2.483476 0.770802 2.319745
H  0.652264 -0.49467 3.280142
H  1.280465 -0.210608 -1.015922
H  2.655288 -2.226459 0.443288
H  2.82925 2.783776 1.869963
H  6.534284 -1.18012 -2.580581
H  7.007704 3.11186 -0.908299
H  3.600478 -3.996742 -1.006701
H  4.132788 4.884368 1.850158
H  5.509533 -3.489738 -2.571379
H  6.243083 5.072177 0.489291
H  -12.077601 0.806504 -1.1358
