program: Gaussian 09
title: 000046663
version: EM64L-G09RevD.01
frameworkgroup: C1[X(C15H12N2O2)]
method: RPBEPBE
basis: SDD
operation: Freq
keyword: #p
keyword: freq=noraman
keyword: PBEPBE/SDD
title: #p freq=noraman PBEPBE/SDD
converged: NO NO NO NO
title: Mulliken charges:
elementType: O O N N C C C C C C C C C C C C C C C H H H H H H H H H H H H
charge: -0.284356 -0.267494 -0.041592 -0.676238 0.307346 0.274710 0.280028 -0.114168 -0.096275 -0.492105 0.214552 -0.302257 -0.350052 -0.346037 -0.315290 -0.280737 -0.231624 0.152871 -0.501398 0.232679 0.266608 0.190211 0.273097 0.267227 0.229213 0.337225 0.326471 0.232346 0.241386 0.241295 0.232359
chargesum: 0.00000
title: Mulliken charges with hydrogens summed into heavy atoms:
elementType: O O N N C C C C C C C C C C C C C C C
charge: -0.284356 -0.267494 -0.041592 -0.012542 0.307346 0.274710 0.280028 -0.114168 -0.096275 -0.259426 0.214552 -0.035649 -0.159841 -0.072940 -0.048064 -0.051524 0.000722 0.152871 0.213642
polarizability: 3.81546692e+02 8.62380998e+00 1.92672360e+02 8.05293462e-03 2.45293068e-03 7.52350729e+01
1716.lowfreq: -0.0009 0.0004 0.0006 4.3802 5.7712 11.0139 38.6823 55.4282 85.7137
frequency: 38.6764 55.4274 85.7126 95.7115 100.4195 127.7148 143.4080 188.5162 220.6133 248.4373 266.4612 306.6746 335.5078 340.9522 375.9719 408.9215 427.4939 463.0139 477.9925 488.3027 502.9693 518.9929 526.7869 573.0617 576.5944 620.0415 648.6367 657.8443 697.0937 719.9313 754.5050 754.8242 760.1613 804.7581 829.0317 853.0830 859.9805 868.3789 897.7419 918.0557 950.2169 965.9936 993.6193 1001.2215 1021.2205 1079.2044 1105.2846 1115.5407 1115.9903 1125.4173 1149.6053 1154.9653 1174.4357 1222.2258 1239.7014 1263.7600 1283.8005 1308.3903 1349.9093 1378.4446 1395.7156 1425.9791 1436.8238 1452.3568 1452.5465 1465.5494 1473.3573 1492.4630 1523.8794 1546.8546 1553.5477 1602.8868 1616.8687 1632.3086 1653.7904 2999.6734 3098.0507 3105.2570 3119.0731 3133.8540 3143.6661 3154.5828 3157.7746 3170.2684 3181.6662 3569.5879 3702.5741
redmass: 4.8074 5.9436 3.2073 1.2072 4.7224 3.4895 3.8008 5.0232 5.1681 6.6211 4.8106 4.3492 4.0386 6.1026 1.2057 3.1683 6.0464 6.8214 1.3324 6.0670 1.9526 3.9555 6.7606 4.8902 3.6459 6.8603 5.1179 6.3581 6.5455 5.2544 2.7698 5.8315 1.6293 2.4795 3.4388 6.1468 1.5917 1.9494 6.0905 1.7187 1.3689 4.7847 1.3317 1.3315 2.3109 3.1060 3.2721 2.2168 1.2658 1.5565 1.4631 1.4294 1.2691 1.9334 1.7557 4.6802 1.5225 4.9117 2.0932 4.8018 4.3897 1.2117 3.2826 1.0495 2.7475 1.0529 4.2064 4.0716 7.2981 7.2701 6.9573 7.8972 6.6315 6.5593 1.2365 1.0300 1.1040 1.0870 1.0901 1.0880 1.1044 1.0945 1.0881 1.0990 1.0974 1.0453 1.1029
irintensity: 0.3209 3.9246 0.6964 0.3166 1.4169 0.0690 8.2654 7.0338 6.1338 0.9434 0.8522 20.3268 0.0082 1.1635 1.6102 5.1863 4.1719 8.4898 197.7520 1.3344 5.6234 0.1496 3.0633 2.5866 18.0301 1.4028 42.9921 9.4553 1.5174 12.6726 2.7160 4.2524 103.6292 2.0997 7.4994 6.6779 19.8781 18.2825 3.8501 15.8239 1.3977 33.8644 0.6120 0.0006 6.9381 139.6286 62.5120 19.9849 0.0659 23.9909 79.1870 76.0356 8.2820 328.1827 109.5033 104.4207 56.9472 33.9986 5.9940 22.0115 88.6107 42.1897 3.8006 14.1168 8.8579 16.4112 21.9535 99.4198 85.0175 23.3372 33.1447 310.2268 51.5925 31.7884 315.2362 54.6059 28.2234 13.6325 2.9243 11.7750 18.7549 25.9835 1.2440 26.7987 5.9111 65.8267 26.2399
temp: 298.150 k
press: 1.00000 atm
elementType: 8 8 7 7 6 6 6 6 6 6 6 6 6 6 6 6 6 6 6 1 1 1 1 1 1 1 1 1 1 1 1
symmnumber: 1
zpe: 620851.7 jmol-1
zpe.correction: 0.236470 hartree
zpe.thermalcorrener: 0.252294 hartree
zpe.thermalcorrenthalpy: 0.253238 hartree
zpe.thermalcorrgfe: 0.193069 hartree
zpe.sumelectzpe: -837.464543 hartree
zpe.sumelectthermal: -837.448719 hartree
zpe.sumelectthermalent: -837.447774 hartree
zpe.sumelectthermalfe: -837.507943 hartree
dipole: 0.6567 2.9355 0.0004
dipole: 3.0081
quadrupole: -84.9278 -100.5496 -115.0834
quadrupole: 13.9530 0.0018 0.0026
quadrupole: 15.2592 -0.3627 -14.8965 13.9530 0.0018 0.0026
hfenergy: -837.7010128 hartree
pointgroup: C01 [X(C15H12N2O2)]
dipole: -0.2514894 -1.1564427 0.0001622 debye
polarizability: 381.4371747|9.7490013|192.7818764|-0.0080382|-0.0025009|75.2350729 unknown
InChI: InChI=1S/C15H12N2O2/c1-19-15(18)9-6-7-13-11(8-9)14(16)10-4-2-3-5-12(10)17-13/h2-8H,16H2,1H3
charge 0 multiplicity 1
31 atoms
O  4.816075 0.559079 -0.000676
O  4.117211 -1.663449 -0.000643
N  -1.477181 1.681074 -0.000034
N  -0.914812 -2.570708 0.000126
C  0.031795 -0.309866 -0.000077
C  -1.099431 -1.204478 0.000033
C  -2.424036 -0.637012 0.000104
C  -0.22625 1.129089 0.000034
C  -2.546122 0.816458 -0.000066
C  1.384342 -0.765111 -0.000298
C  2.458672 0.133277 -0.000201
C  0.903523 2.024887 0.000197
C  -3.6214 -1.4296 0.000356
C  2.207928 1.551142 0.000105
C  -3.863478 1.394735 -0.000227
C  -4.882744 -0.834419 0.000235
C  -5.003353 0.594552 -0.000115
C  3.832904 -0.43594 -0.000445
C  6.211949 0.075966 -0.00093
H  1.644795 -1.831046 -0.000661
H  0.680879 3.096004 0.000367
H  -3.56933 -2.52611 0.000759
H  3.059512 2.236625 0.000214
H  -3.922399 2.487374 -0.00041
H  -5.783443 -1.457837 0.000449
H  0.016894 -2.975527 0.000517
H  -1.704981 -3.208263 -0.000202
H  -5.997994 1.054338 -0.00023
H  6.407034 -0.538228 -0.896853
H  6.408809 -0.533631 0.897758
H  6.828129 0.986425 -0.003787
