program: Gaussian 09
title: 000007091
version: EM64L-G09RevD.01
frameworkgroup: C1[X(C10H8O2)]
method: RPBEPBE
basis: SDD
operation: Freq
keyword: #pfreq=noraman
keyword: PBEPBE/SDD
title: #p freq=noraman PBEPBE/SDD
converged: NO NO NO NO
title: Mulliken charges:
elementType: O O C C C C C C C C C C H H H H H H H H
charge: -0.486848 -0.429701 0.436011 0.420251 -0.556026 -0.545342 -0.421853 -0.415666 0.159233 0.151425 -0.246938 -0.244944 0.230170 0.260216 0.235301 0.241113 0.226128 0.226629 0.375472 0.385368
chargesum: 0.00000
title: Mulliken charges with hydrogens summed into heavy atoms:
elementType: O O C C C C C C C C C C
charge: -0.111376 -0.044332 0.436011 0.420251 -0.325856 -0.285126 -0.186552 -0.174552 0.159233 0.151425 -0.020810 -0.018315
polarizability: 1.89400622e+02 1.35717004e+00 1.19877955e+02 8.07900984e-04 3.99803739e-03 4.48286997e+01
1716.lowfreq: -8.6752 0.0001 0.0007 0.0008 5.9581 7.6692 122.9158 125.5478 271.1365
frequency: 122.9123 125.5478 271.1364 274.5615 289.5015 305.5626 332.7381 403.8516 417.1984 431.4718 476.5925 489.3159 555.9020 564.0479 618.5110 667.7203 688.9913 737.9833 753.5648 768.2363 820.5954 830.9215 866.5644 896.4884 902.6429 957.9716 985.0898 1023.4207 1065.5459 1123.7270 1164.8522 1168.5845 1173.1696 1203.5527 1260.9795 1268.3792 1299.4455 1363.8964 1412.1774 1437.7683 1452.7017 1490.8712 1527.5520 1597.4463 1617.3909 1650.8184 3112.7496 3116.5734 3124.0652 3140.6681 3158.2579 3160.5287 3520.2060 3618.2630
redmass: 5.2947 5.4275 4.5874 4.8936 5.0562 1.2729 3.0882 6.1376 3.4132 7.7763 2.2744 1.2069 3.4637 4.8421 6.7648 6.8295 4.7134 6.4078 1.2523 2.3671 3.5389 1.4081 1.4462 1.8196 5.5532 1.3974 1.3308 2.2813 2.9807 1.5558 1.5259 1.2719 1.1060 1.3790 1.9507 2.2418 2.4622 1.7217 7.6660 2.6998 3.0888 3.9859 4.1284 7.3267 6.0089 7.2359 1.0915 1.0863 1.0881 1.0948 1.0931 1.0995 1.0648 1.0665
irintensity: 0.6249 2.6488 2.5999 5.2025 7.0895 130.5218 48.0493 3.9290 1.7648 2.5619 86.0554 73.2642 2.2273 18.2821 8.5679 8.8761 0.0079 10.9020 46.8661 6.1182 38.3380 22.6035 64.5403 7.5536 2.5897 9.9375 0.0786 7.8092 128.1939 112.6832 15.1873 100.5464 29.9623 46.2964 177.8263 53.7754 25.4293 30.2256 0.4724 1.2498 27.0220 68.0457 111.4421 2.8400 1.8278 10.2266 11.1641 9.6499 0.9083 33.7781 12.5703 25.9781 111.3671 61.6216
temp: 298.150 k
press: 1.00000 atm
elementType: 8 8 6 6 6 6 6 6 6 6 6 6 1 1 1 1 1 1 1 1
symmnumber: 1
zpe: 399607.8 jmol-1
zpe.correction: 0.152203 hartree
zpe.thermalcorrener: 0.161580 hartree
zpe.thermalcorrenthalpy: 0.162524 hartree
zpe.thermalcorrgfe: 0.118084 hartree
zpe.sumelectzpe: -535.479519 hartree
zpe.sumelectthermal: -535.470141 hartree
zpe.sumelectthermalent: -535.469197 hartree
zpe.sumelectthermalfe: -535.513638 hartree
dipole: 0.2899 3.0041 0.0003
dipole: 3.0180
quadrupole: -61.3020 -58.8309 -75.0788
quadrupole: 9.1910 0.0011 0.0016
quadrupole: 3.7685 6.2397 -10.0083 9.1910 0.0011 0.0016
hfenergy: -535.6317213 hartree
pointgroup: C01 [X(C10H8O2)]
dipole: -0.0993614 1.1832228 -0.000116 debye
dipolederiv: -1.3619356 0.472467 -0.0000472 0.6848844 -0.4114614 -0.0000503 0.0000391 -0.0000761 -0.4359574 -1.4746394 -0.3730308 -0.0000066 -0.6083893 -0.308361 0.000012 -0.0000541 -0.0000007 -0.4152902 0.0638352 -0.0651306 -0.0000005 -0.1348732 -0.1164596 0.0000064 0.0000067 0.0000102 0.0439648 0.188524 0.1306728 -0.000007 0.1240091 -0.0782137 0.0000064 -0.0000033 0.0000027 0.0281862 -0.2193506 0.0638165 0.0000069 -0.0611036 0.0184873 -0.000006 0.0000217 -0.0000138 -0.2093725 -0.3039983 -0.1475644 -0.0000037 0.1154049 0.0726705 -0.0000133 -0.0000136 -0.0000068 -0.1942654 0.0702327 0.0180185 0.000002 0.0669251 0.1118821 -0.000016 -0.0000022 -0.0000149 -0.1854029 0.0014556 -0.0554229 0.0000025 -0.0464405 0.1209516 -0.000018 0.0000054 -0.0000201 -0.1771806 0.9774661 -0.4358728 0.0000112 -0.915266 0.3453377 -0.0000008 -0.0000453 0.000026 0.0331353 1.2504736 0.3979801 0.0000207 0.8126712 0.147762 -0.0000033 0.000042 -0.000004 0.0670169 -0.074163 0.0937433 -0.0000059 0.1401869 0.0013458 -0.0000079 -0.0000126 -0.000009 -0.1749693 -0.0327918 -0.0728387 0.0000059 -0.1402378 0.0481487 -0.000011 0.0000105 -0.0000092 -0.1702279 0.057198 0.0045379 -0.0000035 0.0564193 -0.110322 0.0000114 0.0000028 0.0000068 0.176643 0.0814623 0.0204874 -0.0000003 -0.0331614 -0.0505305 0.0000122 0.0000003 0.0000084 0.1714281 0.0739774 0.0378442 -0.0000019 -0.033967 -0.1245629 0.0000149 0.0000012 0.0000168 0.1578227 0.0749527 -0.0379373 0.0000018 0.0291638 -0.1121847 0.0000149 -0.0000036 0.0000183 0.1573965 -0.0967792 -0.0956596 0.0000049 -0.0997422 0.0340265 0.0000066 0.0000059 0.0000063 0.16462 -0.0936594 0.0991049 -0.0000068 0.1021783 0.0316577 0.0000076 -0.0000064 0.000006 0.1635222 0.3631718 -0.1602331 0.000032 -0.1403829 0.1465375 0.0000457 -0.0000069 0.0000554 0.407064 0.4545679 0.1050175 -0.0000044 0.0817209 0.2332883 -0.0000115 0.0000123 -0.0000024 0.3918667 unknown
polarizability: 189.3561817|-2.2202632|119.9223955|0.0007582|-0.0040078|44.8286997 unknown
InChI: InChI=1S/C10H8O2/c11-9-5-7-3-1-2-4-8(7)6-10(9)12/h1-6,11-12H
charge 0 multiplicity 1
20 atoms
O  -3.106333 1.306702 -0.000123
O  -3.061548 -1.366468 -0.000078
C  0.634497 0.734559 -0.000127
C  0.61901 -0.718393 -0.000058
C  -0.613224 1.443157 -0.000161
C  -0.636893 -1.409081 -0.000004
C  1.894786 1.416626 -0.000153
C  1.869253 -1.421333 -0.000018
C  -1.812086 0.740226 -0.000145
C  -1.832948 -0.698725 -0.000049
C  3.096165 0.702423 -0.000116
C  3.082768 -0.728515 -0.000042
H  -0.608673 2.541304 -0.000198
H  -0.672309 -2.503028 0.000055
H  1.904907 2.513617 -0.000211
H  1.858035 -2.517765 0.000047
H  4.053234 1.235774 -0.000144
H  4.030108 -1.27899 -0.000005
H  -3.081605 2.293364 -0.000303
H  -3.792143 -0.692653 -0.000067
