program: Gaussian 09
title: 000046662
version: EM64L-G09RevD.01
frameworkgroup: C1[X(C15H15N3)]
method: RPBEPBE
basis: SDD
operation: Freq
keyword: #pfreq=noraman
keyword: PBEPBE/SDD
title: #p freq=noraman PBEPBE/SDD
converged: YES YES NO NO
title: Mulliken charges:
elementType: N N N C C C C C C C C C C C C C C C H H H H H H H H H H H H H H H
charge: -0.158120 -0.041702 -0.705474 0.454146 -0.034023 0.500945 0.424248 -0.152857 -0.494376 -0.513179 -0.447540 -0.366271 -0.625542 -0.307874 0.520254 -0.421204 -0.645278 -0.644308 0.245957 0.271738 0.228003 0.234864 0.221800 0.257186 0.216569 0.231787 0.232103 0.217768 0.238762 0.238105 0.213339 0.305401 0.304771
chargesum: 0.00000
title: Mulliken charges with hydrogens summed into heavy atoms:
elementType: N N N C C C C C C C C C C C C C C C
charge: -0.158120 -0.041702 -0.095302 0.454146 -0.034023 0.500945 0.424248 -0.152857 -0.248419 -0.241441 -0.219537 -0.131407 -0.403743 -0.050687 0.520254 -0.204635 0.036380 0.045899
polarizability: 4.29855174e+02 1.49033199e+01 1.81403111e+02 5.58002097e-02 8.43605259e-04 8.15621338e+01
1716.lowfreq: -3.9703 -0.0004 0.0003 0.0006 6.5621 16.7659 45.9951 58.0630 96.2098
frequency: 45.9515 58.0532 96.2096 115.4601 126.9037 129.4312 200.4710 201.6345 225.1129 265.9497 283.9199 285.3210 330.2019 339.0778 378.9219 404.3867 411.7106 424.0139 430.2354 467.7092 473.1270 484.8492 508.4540 541.0832 601.9816 616.9190 648.2530 652.8642 720.6025 740.7312 747.6363 770.4871 785.1440 803.1712 831.0868 845.1599 849.9462 866.5465 906.3684 915.8553 942.1942 958.5885 966.7645 969.1757 1043.3698 1056.5723 1108.8169 1111.7082 1135.4278 1146.1768 1154.4174 1189.4305 1218.9321 1233.0702 1256.8522 1258.5588 1275.8381 1325.2456 1334.5695 1356.0967 1373.0769 1406.6830 1416.5831 1431.5972 1452.5889 1458.4209 1462.5334 1476.4493 1487.7080 1496.4104 1501.4584 1510.1903 1519.6401 1545.1423 1588.8072 1631.7507 1641.5487 1652.7435 2937.5011 2945.6535 3002.7429 3005.5673 3091.9242 3103.0569 3107.2263 3111.0965 3115.8617 3116.4616 3161.8016 3165.8181 3178.0035 3568.5492 3709.3121
redmass: 4.3251 2.7241 3.1184 2.3878 2.1263 4.1079 1.6971 1.5211 4.0250 3.4326 3.5765 3.9046 1.1408 3.5576 1.2730 3.6051 3.3880 4.3861 3.4005 2.9989 2.6758 5.0065 4.3166 4.0829 3.0113 8.1295 6.2844 3.4196 6.2667 5.8109 2.6183 5.3327 1.8922 1.6387 1.9036 1.7240 4.6578 1.8299 4.6349 1.6814 2.7833 1.3881 2.4877 1.3439 1.4789 1.4990 1.2626 1.2926 1.4109 1.6896 1.5749 1.2337 2.1780 1.9675 1.7787 2.6723 2.6439 2.8840 3.0902 2.1873 4.8044 3.1072 5.9284 1.1594 2.2772 1.8687 1.0402 1.0458 2.5166 1.3566 1.9877 1.8358 3.0584 6.8589 6.0049 3.5499 1.4587 5.0927 1.0366 1.0393 1.0990 1.1028 1.0963 1.0942 1.0911 1.0912 1.0890 1.0889 1.0955 1.0930 1.0904 1.0448 1.1040
irintensity: 6.1493 0.1327 0.9036 3.0967 0.4934 4.3349 0.8699 3.1250 2.2433 0.2884 0.1075 0.1175 195.8477 0.0703 121.1072 0.3377 6.6165 0.1149 4.0031 6.8042 0.0831 0.2506 1.4554 14.0446 10.0191 2.5116 0.9678 0.5280 4.8782 1.5763 0.5823 1.6357 1.0157 54.7082 32.0525 0.3686 1.9036 38.4629 1.9298 55.0502 9.6248 6.0127 25.1132 0.8313 3.8405 22.5258 0.5991 0.7782 25.6571 41.2703 8.2139 10.7653 17.5344 28.0217 31.0438 14.6483 55.4382 126.4629 57.7497 52.3098 26.2053 1.1010 5.3959 4.3626 134.9599 3.7119 2.6630 18.5088 38.2514 10.9364 18.9139 363.6507 22.8404 72.2539 4.0575 150.7278 4.7398 662.3579 106.7967 159.3349 3.7087 88.2482 4.6851 56.9333 17.2941 20.8647 32.9106 19.6747 17.1354 24.9670 13.3059 128.8032 20.2006
temp: 298.150 k
press: 1.00000 atm
elementType: 7 7 7 6 6 6 6 6 6 6 6 6 6 6 6 6 6 6 1 1 1 1 1 1 1 1 1 1 1 1 1 1 1
symmnumber: 1
zpe: 699496.3 jmol-1
zpe.correction: 0.266424 hartree
zpe.thermalcorrener: 0.282156 hartree
zpe.thermalcorrenthalpy: 0.283100 hartree
zpe.thermalcorrgfe: 0.224000 hartree
zpe.sumelectzpe: -743.597949 hartree
zpe.sumelectthermal: -743.582217 hartree
zpe.sumelectthermalent: -743.581273 hartree
zpe.sumelectthermalfe: -743.640373 hartree
dipole: 0.3062 1.7314 0.0114
dipole: 1.7583
quadrupole: -51.0302 -95.6673 -113.8357
quadrupole: -3.9155 0.0592 -0.0006
quadrupole: 35.8142 -8.8229 -26.9913 -3.9155 0.0592 -0.0006
hfenergy: -743.8643726 hartree
pointgroup: C01 [X(C15H15N3)]
dipole: -0.1295384 -0.6781812 0.0426659 debye
polarizability: 430.1858701|11.399894|180.7416831|-3.4957138|-5.5194968|81.8928658 unknown
InChI: InChI=1S/C15H15N3/c1-18(2)13-5-3-10-7-11-8-12(16)4-6-14(11)17-15(10)9-13/h3-9H,16H2,1-2H3
charge 0 multiplicity 1
33 atoms
N  -4.421241 0.462815 -0.000249
N  0.378443 1.260909 -0.075161
N  5.754104 -0.465164 -0.025717
C  -0.418098 -1.087197 0.059675
C  -0.65523 0.353899 -0.017629
C  1.998219 -0.64077 0.015543
C  -3.106005 -0.016717 0.019365
C  1.660856 0.781121 -0.059287
C  0.914115 -1.556122 0.074815
C  -1.995285 0.851976 -0.03522
C  -1.565175 -1.952876 0.116231
C  -2.856346 -1.447358 0.097168
C  3.372229 -1.046398 0.026018
C  2.745543 1.727025 -0.119792
C  4.405329 -0.099066 -0.034441
C  4.067426 1.307519 -0.108214
C  -5.562377 -0.45834 0.069285
C  -4.653901 1.909665 -0.069362
H  1.111019 -2.634631 0.132479
H  -2.10498 1.937023 -0.092933
H  -1.40741 -3.037189 0.175272
H  -3.69934 -2.142896 0.141723
H  3.609092 -2.117033 0.08275
H  2.482347 2.787911 -0.175532
H  4.879546 2.044547 -0.155296
H  -5.567852 -1.048652 1.008666
H  -5.576453 -1.168939 -0.782122
H  -6.49789 0.122002 0.033921
H  -4.212366 2.3497 -0.986863
H  -4.212754 2.437155 0.801442
H  -5.736703 2.111238 -0.080287
H  6.484034 0.239033 -0.070639
H  6.029302 -1.44129 0.025692
