program: Gaussian 09
title: 000007089
version: EM64L-G09RevD.01
frameworkgroup: C1[X(C10H8O4S)]
method: RPBEPBE
basis: SDD
operation: Freq
keyword: #p
keyword: freq=noraman
keyword: PBEPBE/SDD
title: #p freq=noraman PBEPBE/SDD
converged: YES YES NO NO
title: Mulliken charges:
elementType: S O O O O C C C C C C C C C C H H H H H H H H
charge: 0.987227 -0.567953 -0.423150 -0.503419 -0.504001 0.411118 0.401319 -0.072763 -0.395008 -0.393610 -0.254185 -0.540279 -0.380327 0.307523 -0.392139 0.291886 0.253529 0.283453 0.273641 0.245803 0.227939 0.382069 0.361326
chargesum: 0.00000
title: Mulliken charges with hydrogens summed into heavy atoms:
elementType: S O O O O C C C C C C C C C C
charge: 0.987227 -0.185885 -0.061824 -0.503419 -0.504001 0.411118 0.401319 -0.072763 -0.103122 -0.140081 0.029268 -0.266638 -0.134524 0.307523 -0.164200
polarizability: 2.46319621e+02 7.98636283e+00 1.47376118e+02 -1.38750898e+00 5.00828341e-01 7.51471646e+01
1716.lowfreq: -7.6154 -2.8848 0.0007 0.0009 0.0015 3.8576 27.7865 69.8341 105.2371
frequency: 27.6766 69.8166 105.2312 123.4248 158.2551 168.5848 209.2196 236.7033 276.6075 296.1851 297.0702 340.8074 346.2192 360.7745 406.3209 424.3690 436.0155 461.7398 476.1120 532.7399 581.8934 599.1499 622.7387 642.2644 717.5758 755.9452 772.2221 794.9434 832.6818 847.0962 869.0487 896.7211 930.4996 947.7541 948.9829 967.7964 978.3330 1047.1936 1057.7459 1127.3315 1150.7530 1160.5553 1191.0469 1238.1721 1255.8944 1269.0156 1332.0284 1418.4502 1424.4454 1441.2050 1459.7512 1510.7647 1579.6807 1604.3354 1646.5466 3118.8379 3140.9279 3148.5314 3151.6650 3166.1057 3174.2494 3480.0566 3584.3311
redmass: 7.5813 5.5662 8.5348 5.1778 5.6089 1.7545 5.9667 3.9361 6.3599 4.5043 4.9445 7.9135 1.1026 7.1509 9.6196 3.4784 6.6266 4.4191 2.5427 10.9766 5.8065 6.8631 7.1077 2.8033 6.9099 4.9231 2.4933 1.3795 12.9633 1.6383 1.4206 5.3268 1.6546 3.8501 1.3404 14.3937 1.4035 1.3496 1.8280 1.5980 1.2725 1.2225 1.4521 1.9554 2.3122 1.7829 1.8131 5.1358 2.9446 3.9952 3.3748 4.1128 6.9964 6.8321 6.5186 1.0881 1.0898 1.0965 1.0927 1.0928 1.0963 1.0661 1.0663
irintensity: 1.4369 1.2623 0.0330 1.2958 0.3356 49.6248 12.6231 16.3179 15.0249 67.0292 1.4578 1.9434 143.9334 0.1554 86.0076 7.0281 9.0589 4.7358 19.5923 114.7866 14.7372 80.8287 10.3154 2.6509 10.3119 0.4197 2.9601 1.2727 75.3559 81.3925 3.5596 23.8048 32.7425 23.2540 3.9169 101.7471 3.0156 44.9106 64.6589 125.6937 144.9306 3.7830 13.8527 4.2841 81.5569 8.3182 20.0659 12.2250 1.1543 19.7147 14.3463 69.8280 22.5031 4.1335 85.9936 9.9573 6.5532 15.9871 3.6296 2.7665 6.1699 43.6886 70.9248
temp: 298.150 k
press: 1.00000 atm
elementType: 16 8 8 8 8 6 6 6 6 6 6 6 6 6 6 1 1 1 1 1 1 1 1
symmnumber: 1
zpe: 414740.2 jmol-1
zpe.correction: 0.157966 hartree
zpe.thermalcorrener: 0.171813 hartree
zpe.thermalcorrenthalpy: 0.172758 hartree
zpe.thermalcorrgfe: 0.116999 hartree
zpe.sumelectzpe: -1083.577491 hartree
zpe.sumelectthermal: -1083.563644 hartree
zpe.sumelectthermalent: -1083.562699 hartree
zpe.sumelectthermalfe: -1083.618458 hartree
dipole: -6.1570 2.6131 1.4803
dipole: 6.8504
quadrupole: -78.0307 -92.5022 -100.8241
quadrupole: -5.6612 9.0201 -1.6295
quadrupole: 12.4216 -2.0498 -10.3718 -5.6612 9.0201 -1.6295
hfenergy: -1083.7354569 hartree
pointgroup: C01 [X(C10H8O4S1)]
dipole: 2.4003034 1.0872504 -0.5659632 debye
dipolederiv: 2.1813256 0.1196648 0.0883384 0.378177 1.2492065 0.0252059 0.2188599 0.0530884 1.6382243 -0.6028345 0.0282822 -0.239648 -0.0275486 -0.5368022 -0.0647589 -0.3507707 -0.0767127 -0.9890934 -1.2777511 0.6040176 -0.0271965 0.9215575 -0.5181711 0.0053732 -0.0332472 0.0019097 -0.420347 -0.7086134 -0.0631914 -0.0176652 -0.1632766 -0.6283039 0.1134456 -0.0026834 0.0352611 -0.5050224 -0.8134147 0.0256453 0.0644645 0.0009426 -0.5517531 -0.1054212 0.00793 -0.0318512 -0.51788 0.2331627 -0.2759203 0.0113087 -0.2227078 0.048966 -0.0009123 -0.0071496 -0.0059698 0.0406245 -0.0247871 -0.1093842 0.0029353 0.1821245 -0.1832076 0.0099261 -0.0067172 0.0121886 0.0308353 -0.1618826 0.0678067 0.0139405 0.1099422 0.1151872 -0.0047257 0.1679787 0.0141414 -0.147958 -0.0526001 0.1735789 -0.0133142 -0.2851264 -0.0902517 -0.0038115 0.0003488 -0.01311 -0.0946807 0.1288206 0.1368037 -0.0073235 -0.1820921 0.1320767 -0.0120383 -0.008761 -0.0166867 -0.1350861 -0.3889789 -0.2249899 -0.0000989 0.1640857 -0.1038799 -0.0032428 -0.0287776 0.0163202 -0.1175294 -0.5461228 0.3203781 -0.0143737 -0.0948048 0.0215732 -0.0098567 0.0097009 -0.0069266 -0.1744219 0.1206877 0.111148 -0.0056859 0.0131559 0.1244647 -0.0096333 -0.0013223 -0.0107934 -0.1369582 1.2667901 -0.679576 0.0280257 -0.8462035 0.4461371 -0.0153422 0.0293504 -0.0121662 0.0837566 -0.0924379 0.0644881 -0.003767 0.3830513 -0.1126741 -0.0022052 -0.0154346 -0.0028994 -0.1742819 0.1393331 0.0004719 0.0081457 -0.0073193 0.0436567 0.0045276 0.0038411 0.0127125 0.1523524 0.0342646 -0.0717608 0.0023299 -0.0161546 -0.0698298 0.0067339 0.0077752 0.0089314 0.1575243 0.0784226 0.0682136 0.0037105 0.0304091 0.1051502 0.0070832 0.0083387 -0.006098 0.1626328 0.087972 -0.0453757 0.0026156 0.0082975 -0.016154 0.0076667 -0.0010435 0.0077648 0.1722481 0.0740179 0.0109366 -0.0001955 -0.0554715 -0.0803739 0.0087498 0.0022463 0.008809 0.1540929 -0.1320699 -0.0447308 0.0019381 -0.0156533 0.0770969 0.0036155 0.001879 0.0039232 0.1691136 0.1146786 -0.0727997 0.0948361 -0.0676223 0.3263638 0.0321745 -0.0102227 0.0004057 0.26348 0.3420174 -0.1437066 0.0066795 -0.2077627 0.2015221 0.0074464 0.0078808 0.007758 0.3883744 unknown
polarizability: 246.7052295|-4.9287785|146.9096931|1.8515321|-2.3946539|75.2279804 unknown
InChI: InChI=1S/C10H8O4S/c11-9-3-1-7-2-4-10(15(12,13)14)6-8(7)5-9/h1-6,11-12H
charge 0 multiplicity 1
23 atoms
S  -3.200592 -0.544136 0.081193
O  -3.445993 -0.584566 -1.76239
O  4.400759 -1.643703 0.080028
O  -3.222764 -2.062522 0.639307
O  -4.199503 0.571027 0.69679
C  0.932954 -0.333544 0.037594
C  1.157173 1.100618 -0.02052
C  -1.447132 0.10702 0.026116
C  -0.417083 -0.820023 0.057169
C  0.037554 1.995981 -0.046742
C  -1.272721 1.516286 -0.026046
C  2.045907 -1.227724 0.070365
C  2.50712 1.579088 -0.041637
C  3.347647 -0.719922 0.04668
C  3.583598 0.693695 -0.009626
H  -0.626994 -1.893687 0.109385
H  0.220557 3.075567 -0.084949
H  -2.139707 2.1825 -0.031597
H  1.893113 -2.31012 0.114101
H  2.689434 2.658649 -0.083698
H  4.613042 1.074305 -0.026997
H  -4.391823 -0.867508 -1.931617
H  5.280151 -1.19118 0.059989
