program: Gaussian 09
title: 000046646
version: EM64L-G09RevD.01
frameworkgroup: C1[X(C10H12FNO2)]
method: RPBEPBE
basis: SDD
operation: Freq
keyword: #p
keyword: freq=noraman
keyword: PBEPBE/SDD
title: #p freq=noraman PBEPBE/SDD
converged: YES YES NO NO
title: Mulliken charges:
elementType: F O O N C C C C C C C C C C H H H H H H H H H H H H
charge: -0.250522 -0.263380 -0.255020 -0.439860 0.493736 0.344622 -0.453335 -0.323191 -0.328751 -0.370963 -0.244856 0.146853 -0.684241 -0.314576 0.223264 0.305503 0.246683 0.251683 0.339348 0.207280 0.207006 0.206990 0.232978 0.233076 0.244805 0.244868
chargesum: 0.00000
title: Mulliken charges with hydrogens summed into heavy atoms:
elementType: F O O N C C C C C C C C C C
charge: -0.250522 -0.263380 -0.255020 -0.100512 0.493736 0.344622 -0.230071 -0.017688 -0.082069 -0.119280 0.169431 0.146853 -0.011197 0.175097
polarizability: 2.12399242e+02 9.61360507e+00 1.19473778e+02 9.76876615e-02 3.39409003e-02 6.35937129e+01
1716.lowfreq: -11.8691 -6.6026 -4.6822 0.0007 0.0007 0.0010 37.5041 47.3404 86.9986
frequency: 37.5035 47.3156 86.9941 89.0728 108.1539 117.1062 155.1455 190.8918 197.7735 248.5967 290.7339 354.9743 373.8044 406.1692 414.9027 477.9291 494.7681 519.4265 570.6510 622.6740 642.4233 723.4150 750.3417 757.3140 804.6385 831.2981 838.9824 852.1728 902.3491 914.1318 925.2041 955.6412 983.8550 997.3227 1000.4357 1037.3651 1116.0407 1125.2729 1135.9821 1165.3414 1181.1352 1211.8661 1220.9631 1261.5828 1270.4305 1308.0012 1331.4394 1361.2076 1380.9513 1400.3387 1427.4871 1438.4525 1461.4581 1477.0236 1487.5193 1503.7848 1530.8789 1594.0329 1619.8670 1631.4220 2951.1935 2997.1337 3009.0959 3036.7371 3094.6257 3106.3579 3113.4148 3118.3186 3161.5247 3168.7339 3193.0966 3486.5887
redmass: 4.2643 4.9637 4.6840 5.3447 2.6995 1.8767 5.0267 5.2355 8.0890 1.1803 4.3689 6.0160 5.6955 4.3038 3.0437 8.5283 5.3919 2.5166 3.2808 6.1557 5.9309 3.4513 1.1671 4.5695 1.3054 1.1225 5.6390 1.5119 3.3600 7.7939 1.3892 6.2550 1.3152 1.8420 2.6651 2.8169 2.1091 1.3212 1.4380 1.0725 1.2716 3.2218 2.7455 1.1423 2.2491 1.3835 1.2623 1.5923 3.1565 1.3080 3.9058 1.0912 1.0400 1.0886 1.1482 2.0602 2.4532 4.8792 6.6399 6.5427 1.0552 1.0362 1.1075 1.0557 1.0989 1.1014 1.1102 1.0900 1.0903 1.0933 1.0957 1.0758
irintensity: 0.3645 0.1964 1.0301 0.4306 16.8162 7.5573 0.0032 0.3665 12.5238 0.7697 1.8028 9.7605 1.7718 8.3956 0.0016 0.3300 44.3056 26.4587 1.5631 0.2409 0.0669 2.6970 40.3204 18.2280 70.0928 0.2048 7.8453 73.3336 46.1424 41.2794 4.1362 24.2142 2.1193 1.2109 4.6330 78.1606 2.5493 23.1727 4.5348 1.8579 90.9527 28.4372 231.8349 0.0321 23.0225 2.6823 4.5174 2.8007 68.0961 53.5000 5.9357 11.2648 11.9715 47.8433 48.8711 88.3919 347.4181 107.0130 263.4904 9.0305 43.7515 27.1310 39.0731 21.0546 29.4334 34.3580 9.5541 18.1029 4.1769 12.2695 4.5506 50.5804
temp: 298.150 k
press: 1.00000 atm
elementType: 9 8 8 7 6 6 6 6 6 6 6 6 6 6 1 1 1 1 1 1 1 1 1 1 1 1
symmnumber: 1
zpe: 537127.9 jmol-1
zpe.correction: 0.204581 hartree
zpe.thermalcorrener: 0.218345 hartree
zpe.thermalcorrenthalpy: 0.219289 hartree
zpe.thermalcorrgfe: 0.162884 hartree
zpe.sumelectzpe: -692.262998 hartree
zpe.sumelectthermal: -692.249235 hartree
zpe.sumelectthermalent: -692.248291 hartree
zpe.sumelectthermalfe: -692.304695 hartree
dipole: -1.6583 -3.2404 0.0111
dipole: 3.6401
quadrupole: -66.7999 -84.5401 -83.8271
quadrupole: 3.6568 -0.0271 -0.0131
quadrupole: 11.5891 -6.1511 -5.4381 3.6568 -0.0271 -0.0131
hfenergy: -692.4675795 hartree
pointgroup: C01 [X(C10H12F1N1O2)]
dipole: 0.7349741 1.1661478 -0.3884918 debye
dipolederiv: -0.4649055 0.0406926 0.0033122 0.2867835 -0.7305452 0.1142083 -0.0686822 0.1329626 -0.3005077 -2.1857923 -0.037166 0.149515 0.0535016 -0.3040692 0.0027677 0.1225242 0.0085271 -0.2917674 -0.7179175 0.0603359 0.0099363 -0.6873561 -0.8833213 0.2064282 0.2293691 0.149491 -0.4173903 -1.5447026 -0.2024897 0.1547788 -0.3330922 -0.4363239 0.0686666 0.1948166 0.0593404 -0.320723 0.8704156 -0.0922092 -0.0339312 -0.2293686 -0.074421 0.059205 0.005395 0.0483121 0.0534764 1.6946446 -0.1195652 -0.083343 -0.4785174 0.0201172 0.05355 0.0190466 0.0280732 0.0770735 0.002696 0.114317 -0.0470695 -0.097977 0.078957 -0.0695278 0.0145364 -0.0853413 -0.1623775 0.0012185 -0.0840842 0.0130213 0.0354954 0.0106044 -0.0501012 -0.0215546 -0.0411621 -0.1391066 -0.3101062 -0.0716977 0.0288162 0.4251704 -0.0352659 -0.0783364 -0.1142236 -0.041295 -0.1763631 -0.4188786 0.0661757 -0.0009393 -0.2359176 0.0873651 -0.0560685 0.085907 -0.078864 -0.1511125 1.0188528 0.132237 -0.083245 0.5679077 0.3524957 -0.0273066 -0.2073523 0.0046101 0.4154897 1.4122934 0.1607458 -0.1436252 1.0625315 1.0378901 -0.337987 -0.4080087 -0.2696018 0.2687229 -0.1498155 0.0528701 -0.001765 0.0124736 0.0511637 0.0005158 0.0099153 -0.0024309 0.0537134 0.2234778 0.0873362 -0.0143727 -0.1478233 0.6828408 -0.082464 0.054214 -0.1004967 0.3898522 0.0325569 0.0934046 -0.0173155 0.0905922 -0.0585216 0.0579559 -0.0164708 0.0575931 0.1491891 0.1304365 -0.0619485 0.0212842 -0.0315353 0.0832868 0.0297438 0.0125904 0.0321277 0.1677144 -0.003257 -0.0895773 0.038737 -0.1105303 0.0197277 0.0505962 0.0446606 0.0488269 0.1484683 0.0682599 0.0558684 -0.0090196 0.0652123 -0.0185559 0.0479124 -0.0119429 0.0487624 0.1503393 0.2690477 -0.0659218 0.0224211 -0.0414378 0.1885608 0.0384554 0.0150898 0.0402785 0.2968459 -0.0440937 0.0291585 -0.0706071 -0.1071358 0.0028543 0.0837692 0.0240498 0.0922351 -0.1486022 -0.0352138 0.0470966 0.0425791 -0.1163506 -0.1181563 -0.0878838 0.0343327 -0.1173641 -0.034376 -0.0942916 -0.090164 0.0406145 -0.1335448 -0.0175845 0.0477011 0.0530407 0.0447913 0.0977202 0.0979143 0.0092183 -0.0130032 0.0634194 0.0733087 0.0628008 -0.066728 0.070833 -0.107624 0.1025536 -0.0042321 -0.0096478 0.0711801 -0.0435741 -0.1158183 0.0061321 -0.1150618 0.0049618 0.035871 0.0043572 0.0585816 0.0425748 0.0289353 0.000717 0.1072194 0.0200646 -0.0387584 0.0087358 -0.0347581 -0.0557129 -0.0262558 0.0022315 -0.0194996 -0.1178766 -0.0352116 0.0151415 unknown
polarizability: 212.5024942|0.1847411|114.2453319|-11.1735233|-14.749381|68.7189066 unknown
InChI: InChI=1S/C10H12FNO2/c1-2-14-9-5-3-8(4-6-9)12-10(13)7-11/h3-6,12H,2,7H2,1H3
charge 0 multiplicity 1
26 atoms
F  -4.341568 2.011704 -0.254207
O  3.440955 -0.608294 -0.077659
O  -3.137663 -1.322109 0.628341
N  -2.07156 0.686691 -0.041905
C  -0.687676 0.340361 -0.045852
C  2.092499 -0.220782 -0.090578
C  0.243661 1.344191 -0.406739
C  -0.217431 -0.958538 0.295101
C  1.627808 1.074432 -0.43193
C  1.161317 -1.226705 0.270046
C  4.451007 0.405725 -0.439284
C  -3.153838 -0.103858 0.273338
C  5.814858 -0.270238 -0.329173
C  -4.506089 0.611813 0.16941
H  -0.109843 2.348934 -0.671491
H  -0.933388 -1.73428 0.573324
H  2.320385 1.871996 -0.714637
H  1.540919 -2.219625 0.529631
H  -2.309951 1.649604 -0.30528
H  4.261158 0.763466 -1.472625
H  4.371782 1.268579 0.254214
H  6.615652 0.444688 -0.592001
H  5.989184 -0.629354 0.699307
H  5.877488 -1.13365 -1.013138
H  -5.003225 0.620147 1.154264
H  -5.140141 0.111004 -0.581676
