program: Gaussian 09
title: 000047858
version: EM64L-G09RevD.01
frameworkgroup: C1[X(C20H28N2O5)]
method: RPBEPBE
basis: SDD
operation: Freq
keyword: #p
keyword: freq=noraman
keyword: PBEPBE/SDD
title: #p freq=noraman PBEPBE/SDD
converged: YES YES NO NO
title: Mulliken charges:
elementType: O O O O O N N C C C C C C C C C C C C C C C C C C C C H H H H H H H H H H H H H H H H H H H H H H H H H H H H
charge: -0.310465 -0.250634 -0.292515 -0.265531 -0.264008 -0.088679 -0.436699 -0.355055 -0.362545 -0.393270 -0.389098 -0.397739 -0.328870 -0.425006 -0.261925 0.016963 0.233726 0.134705 0.298691 0.043007 0.032858 -0.359684 -0.189016 0.219008 -0.513795 -0.524188 -0.776634 0.203710 0.170304 0.168966 0.217128 0.202876 0.191316 0.192034 0.195640 0.189487 0.213313 0.225327 0.185881 0.198874 0.200552 0.197350 0.281863 0.262142 0.317521 0.262907 0.219172 0.255610 0.230646 0.200828 0.282542 0.223168 0.251296 0.212231 0.253716
chargesum: 0.00000
title: Mulliken charges with hydrogens summed into heavy atoms:
elementType: O O O O O N N C C C C C C C C C C C C C C C C C C C C
charge: -0.310465 -0.250634 -0.292515 -0.265531 -0.264008 -0.088679 -0.119178 0.018960 0.023548 0.000922 -0.001425 0.005060 0.082338 -0.025580 0.217288 0.016963 0.233726 0.134705 0.298691 0.043007 0.032858 -0.097542 0.073890 0.219008 0.191634 0.182350 -0.059391
polarizability: 3.09416438e+02 4.88851776e-01 2.96829402e+02 -1.52644263e+01 -3.80568517e+00 1.70052073e+02
1716.lowfreq: -0.0004 0.0004 0.0006 1.0304 4.7138 5.7315 12.5214 22.4278 30.0467
frequency: 11.2977 22.1051 29.9993 41.2791 42.4840 55.9731 63.8192 66.4079 72.3648 83.6746 97.6184 125.1876 135.6208 145.4970 151.0752 172.1927 184.0422 191.3632 192.8647 197.4489 227.3614 238.4121 253.0082 277.4565 282.7008 292.9785 307.1291 310.2111 327.3302 332.0192 358.3576 376.0490 385.2521 409.4716 450.4530 468.1360 473.8697 486.3910 504.4143 531.9173 554.2074 565.5802 580.9578 591.3719 600.7421 643.0244 674.9028 678.1272 719.6228 734.6475 744.8979 767.1995 802.7148 803.7021 843.6053 849.7818 852.1657 857.2459 864.8915 882.2247 895.4609 908.5915 913.9886 935.8906 957.2333 965.0513 979.5420 990.4521 996.8112 1013.7104 1027.5493 1038.5324 1040.8722 1056.3294 1078.2591 1084.5046 1104.2314 1107.3976 1114.2631 1116.8358 1118.5943 1124.2423 1133.3923 1148.4074 1156.5762 1157.0044 1162.3735 1181.1088 1194.6118 1216.5954 1249.3619 1256.2451 1263.8810 1266.6778 1287.7463 1292.4694 1302.6020 1326.9965 1330.0219 1338.5033 1341.8337 1344.1392 1347.0596 1354.9136 1369.8439 1373.6364 1383.2009 1388.6168 1411.8879 1419.3598 1435.7662 1446.5805 1448.3158 1448.8447 1450.7672 1457.3336 1459.1811 1462.2342 1462.8055 1466.6524 1469.8457 1475.0334 1476.5418 1480.0749 1483.2103 1483.3484 1497.7592 1528.9630 1589.3301 1609.8856 1636.3418 2815.4350 2826.1214 2867.9556 2966.3511 2979.1798 2981.2479 2981.5962 2984.6710 2984.8833 2993.0667 2995.7194 3025.3380 3028.5461 3033.3590 3035.2716 3042.0075 3050.6388 3052.3625 3084.4968 3086.9787 3094.3620 3107.0506 3113.7542 3125.4340 3130.4238 3230.8070 3268.0747 3507.0774
redmass: 4.6708 4.8227 3.1114 3.8320 3.2217 3.4762 3.5546 3.2260 1.7851 1.7652 3.4819 1.4818 2.3856 3.5591 2.2963 3.1888 2.8970 2.5205 2.5986 3.0728 5.0054 1.8384 6.0278 2.1634 4.8354 4.6005 3.5278 4.5164 3.4769 4.0394 2.8547 4.4548 1.9043 2.7603 2.8383 5.4355 4.4568 3.6861 4.6323 1.9043 3.2765 4.4581 3.1808 3.2433 1.7132 5.2856 8.0928 5.2550 2.6456 1.6432 5.4981 4.2005 1.7618 1.9232 3.4773 3.6910 1.5956 1.4303 2.8256 3.8394 2.8032 2.5184 5.8061 6.1038 1.3049 3.7080 2.1743 3.6520 2.1687 2.1995 4.3281 1.6945 2.0722 1.8553 1.6441 3.0769 1.6060 1.6078 1.2858 2.2207 2.3051 2.5288 1.7026 1.2979 1.4051 2.0394 1.7237 1.2980 1.1654 3.3229 2.5649 1.3288 1.4253 1.2094 1.2667 1.4574 2.1502 1.4588 1.6609 1.4206 1.5639 4.7947 1.5715 1.6314 1.4184 2.1430 1.2233 1.4810 2.9897 1.4101 1.3510 1.0951 1.0951 1.1046 1.0919 1.0665 1.0945 1.0926 2.1683 1.0908 1.2283 1.0904 1.0662 1.0992 1.0916 1.1012 2.1417 5.2991 9.3548 8.8651 5.8636 1.0715 1.0701 1.0709 1.0623 1.0602 1.0617 1.0326 1.0608 1.0318 1.0365 1.0649 1.0865 1.0916 1.0945 1.0921 1.1031 1.0943 1.1037 1.0987 1.1017 1.0996 1.0985 1.0993 1.1041 1.1050 1.0915 1.1078 1.0752
irintensity: 0.0954 0.1429 0.3378 1.9061 3.4928 0.5734 3.5564 3.3723 3.2783 0.7107 4.9497 1.9318 0.7643 2.5252 2.6677 1.0600 9.1744 2.1488 1.9268 17.9837 3.3774 0.1977 5.8832 7.2211 8.6133 9.0568 3.1658 2.9895 12.4173 0.5294 1.2154 2.0820 2.6039 2.4144 0.4300 4.2390 7.9129 5.2464 18.3405 6.8640 6.8601 6.0831 1.5823 19.3319 55.3025 3.4592 0.5760 13.8968 14.5323 49.9969 2.3592 26.2416 0.2176 0.2222 3.1767 13.0911 4.1076 4.8737 15.2113 2.6750 12.5054 11.9158 12.5034 19.6793 4.1410 74.8692 20.4657 1.9612 53.6209 1.7757 240.5011 33.4104 13.3023 6.4721 8.1617 82.2730 1.5972 4.9533 21.2133 24.8669 97.0231 5.6733 11.7738 9.2914 4.8820 27.9190 11.8397 8.1165 32.9214 36.2577 87.5537 2.6763 4.2601 10.8026 14.8319 13.6674 18.4472 67.9017 123.0166 9.4522 6.7634 42.4789 1.0820 3.4011 3.8809 28.6775 52.7840 3.4988 97.2280 16.2810 7.9184 15.6356 11.3947 59.1802 16.7095 34.2503 6.3023 4.3576 359.6213 5.9663 51.1258 5.2639 6.8214 10.0889 8.4380 18.8824 159.1282 7.7822 16.8132 24.8092 156.4151 56.1998 147.1729 151.9400 42.4618 24.9364 15.0369 71.5235 44.1352 75.0627 11.3630 72.0994 69.5978 65.8269 3.0922 22.7969 29.0252 59.9250 108.9460 17.4950 28.9276 22.9670 10.7350 13.0456 21.5680 16.0511 2.2697 0.2656 43.6313
temp: 298.150 k
press: 1.00000 atm
elementType: 8 8 8 8 8 7 7 6 6 6 6 6 6 6 6 6 6 6 6 6 6 6 6 6 6 6 6 1 1 1 1 1 1 1 1 1 1 1 1 1 1 1 1 1 1 1 1 1 1 1 1 1 1 1 1
symmnumber: 1
zpe: 1191572.0 jmol-1
zpe.correction: 0.453846 hartree
zpe.thermalcorrener: 0.481878 hartree
zpe.thermalcorrenthalpy: 0.482822 hartree
zpe.thermalcorrgfe: 0.392625 hartree
zpe.sumelectzpe: -1262.420412 hartree
zpe.sumelectthermal: -1262.392380 hartree
zpe.sumelectthermalent: -1262.391436 hartree
zpe.sumelectthermalfe: -1262.481633 hartree
dipole: 2.9746 -0.8080 -0.6546
dipole: 3.1511
quadrupole: -151.4270 -143.3943 -163.7341
quadrupole: 10.9350 1.0907 -9.9181
quadrupole: 1.4248 9.4575 -10.8823 10.9350 1.0907 -9.9181
hfenergy: -1262.8742579 hartree
pointgroup: C01 [X(C20H28N2O5)]
dipole: 1.1678505 0.2960237 0.2923792 debye
polarizability: 308.8741593|-1.4059168|296.902143|17.4626463|2.6261876|170.5216115 unknown
InChI: InChI=1S/C20H28N2O5/c1-14(23)21-16-17(24-2)15-8-13-27-18(15)20(25-3)19(16)26-12-7-11-22-9-5-4-6-10-22/h8,13,21H,4-7,9-12H2,1-3H3
charge 0 multiplicity 1
55 atoms
O  0.254006 -1.043848 0.526716
O  -1.870709 3.474289 0.42239
O  0.67867 1.817347 0.599563
O  -4.534101 -0.496488 0.249097
O  -3.553758 -2.477559 -1.60941
N  3.960639 -0.80617 -0.00366
N  -2.13688 -2.126322 0.233181
C  5.246987 -1.0103 0.707543
C  4.175257 -0.33139 -1.393966
C  6.068895 0.293879 0.760753
C  4.959083 0.997412 -1.405547
C  6.306302 0.845873 -0.663308
C  3.057568 -1.979361 0.083141
C  2.279478 -2.023846 1.419258
C  1.319533 -0.843709 1.564185
C  -0.799046 -0.114207 0.441576
C  -2.102874 -0.704185 0.266609
C  -0.61584 1.293509 0.44682
C  -3.098419 1.51183 0.228293
C  -1.795329 2.062558 0.346852
C  -3.267737 0.100219 0.190404
C  -4.017659 2.641347 0.254436
C  -3.256197 3.782536 0.363737
C  -2.8272 -2.927432 -0.678156
C  1.026325 2.98101 -0.244034
C  -5.426565 -0.269558 -0.914689
C  -2.647092 -4.427909 -0.447639
H  5.035953 -1.363145 1.734075
H  5.858278 -1.808286 0.204973
H  4.736835 -1.088877 -2.004351
H  3.1855 -0.193874 -1.867108
H  5.513403 1.040733 1.36041
H  7.032522 0.101458 1.271041
H  5.12227 1.321543 -2.451601
H  4.345896 1.771637 -0.90307
H  6.956549 0.143309 -1.225333
H  6.838886 1.814924 -0.621401
H  2.319417 -1.91033 -0.736535
H  3.613133 -2.940705 -0.055275
H  1.720032 -2.977966 1.487892
H  2.983273 -1.999663 2.274375
H  0.830838 -0.823173 2.558638
H  1.835774 0.109303 1.373596
H  -5.103813 2.602987 0.223851
H  -1.363044 -2.566482 0.739816
H  -3.491793 4.841644 0.417575
H  0.843888 2.753864 -1.311202
H  0.448314 3.871606 0.05391
H  2.101198 3.141651 -0.070156
H  -5.575269 0.80967 -1.104851
H  -4.995328 -0.77319 -1.79417
H  -6.383047 -0.737052 -0.635464
H  -2.550884 -4.930953 -1.423132
H  -1.773855 -4.675609 0.181362
H  -3.551563 -4.826145 0.046991
