program: Gaussian 09
title: 000007142
version: EM64L-G09RevD.01
frameworkgroup: C1[X(C26H20N2)]
method: RPBEPBE
basis: SDD
operation: Freq
keyword: #pfreq=noraman
keyword: PBEPBE/SDD
title: #p freq=noraman PBEPBE/SDD
converged: YES YES NO YES
title: Mulliken charges:
elementType: N N C C C C C C C C C C C C C C C C C C C C C C C C C C H H H H H H H H H H H H H H H H H H H H
charge: -0.526183 -0.526193 0.486180 0.486165 0.405973 0.405975 0.379088 0.379085 0.477419 0.477406 -0.593899 -0.593897 -0.477658 -0.477654 -0.411685 -0.411686 -0.442609 -0.442605 -0.399311 -0.399336 -0.432857 -0.432856 -0.414402 -0.414402 -0.243014 -0.243014 -0.250335 -0.250335 0.269296 0.269307 0.295503 0.295500 0.223594 0.223600 0.234787 0.234788 0.228543 0.228549 0.268895 0.268904 0.235821 0.235822 0.236178 0.236177 0.224832 0.224832 0.225857 0.225856
chargesum: 0.00000
title: Mulliken charges with hydrogens summed into heavy atoms:
elementType: N N C C C C C C C C C C C C C C C C C C C C C C C C C C
charge: -0.230680 -0.230693 0.486180 0.486165 0.405973 0.405975 0.379088 0.379085 0.477419 0.477406 -0.324602 -0.324590 -0.254064 -0.254054 -0.176898 -0.176898 -0.214066 -0.214056 -0.130416 -0.130432 -0.197037 -0.197034 -0.178225 -0.178225 -0.018182 -0.018182 -0.024479 -0.024479
polarizability: 5.48600631e+02 2.77477725e-03 4.03660250e+02 5.83712269e-03 2.96442999e+00 1.30006333e+02
1716.lowfreq: -3.1936 -1.5497 -0.2982 -0.0007 -0.0004 0.0011 17.8713 18.3941 27.8955
frequency: 17.8687 18.3912 27.8948 43.7125 64.7757 66.4617 117.4590 135.6932 145.6579 185.2537 186.7947 194.7476 231.6536 256.6607 292.4389 300.2424 317.6567 367.4895 386.1516 398.3872 401.3324 412.6949 416.0825 474.8632 475.1723 479.1390 489.0420 495.1683 503.9465 512.4859 518.6350 527.9973 537.4945 545.8517 600.5867 619.1603 634.5631 636.1582 646.2361 653.3246 702.1245 725.1011 739.6920 755.0836 755.7995 760.0677 761.2180 780.6381 782.1352 808.9459 816.8512 816.8624 827.2947 827.7635 851.2690 857.8823 868.2670 895.0584 903.1995 914.7454 916.1397 928.6892 948.1518 948.6804 955.9551 959.3648 965.3660 967.3546 971.7672 985.9268 985.9601 997.5559 1023.4540 1023.4888 1122.7038 1124.6784 1127.0207 1159.9808 1160.4360 1171.1422 1171.1536 1187.0855 1192.5559 1195.1975 1234.1093 1235.2326 1250.6877 1254.8996 1267.2948 1277.2806 1277.8220 1279.0019 1315.6733 1358.8447 1359.7689 1373.5862 1413.7157 1414.4493 1416.3115 1417.1781 1433.6288 1441.5198 1447.6138 1471.9575 1476.4780 1476.6222 1501.1198 1511.6531 1525.2353 1542.0592 1581.8216 1584.5129 1594.2368 1610.2486 1610.9721 1635.9148 1640.3473 1644.0592 3110.1573 3110.1854 3113.1014 3116.9308 3116.9511 3121.9617 3121.9802 3136.7937 3138.1986 3138.3015 3140.4236 3140.4883 3149.0530 3152.5997 3157.7370 3160.7440 3160.7874 3174.8967 3541.0491 3541.1249
redmass: 4.9945 5.9345 4.3257 4.5898 4.0371 5.6406 4.9729 4.8219 5.4723 3.6836 3.9635 6.1415 5.1510 5.2291 4.2713 3.9676 5.8814 2.9293 4.0435 2.9936 3.0530 3.2046 3.2507 2.2823 2.4159 2.2506 1.6923 2.1838 3.7899 6.2571 3.8900 4.2835 3.4149 4.4817 5.6588 6.6700 6.7384 4.7326 2.9026 3.2945 4.1125 5.0290 3.9078 1.3460 1.4017 4.6800 4.6545 2.4830 2.7320 1.4222 1.4554 1.4379 4.7097 1.5818 3.8461 1.4483 1.6231 1.8143 2.1426 4.4707 2.7929 1.3740 1.3485 1.3578 3.5896 3.4491 1.3736 1.4143 1.3347 1.3394 1.3397 2.7362 2.2340 2.2266 1.6074 1.6915 1.4227 1.2970 1.2667 1.0843 1.0882 1.3217 1.3513 1.5828 2.3894 2.4649 1.5816 1.6505 1.4745 1.7923 1.8076 2.1525 1.6647 1.7943 2.3210 3.5404 2.3593 3.1631 4.8862 5.8317 3.4684 4.7669 3.8899 2.6427 2.8254 2.0421 2.6778 3.1643 3.3903 2.3135 7.7203 5.6165 3.6766 5.4538 5.6139 6.5542 6.4643 6.5717 1.0868 1.0869 1.0869 1.0857 1.0857 1.0889 1.0889 1.0968 1.0967 1.0967 1.0947 1.0947 1.0899 1.0916 1.0894 1.1000 1.1001 1.0959 1.0753 1.0754
irintensity: 0.3994 0.0458 0.3940 1.3996 0.5599 0.7398 0.7245 9.2284 2.0486 0.0198 5.4243 2.2165 2.1761 3.2746 13.4321 2.6121 0.2874 51.9421 2.3121 18.9314 4.0933 1.5741 11.0019 116.1387 32.1230 40.3845 91.9301 84.8041 2.1203 0.7195 1.9089 3.6035 1.9240 1.1676 7.0149 5.0415 0.0364 1.7100 9.6431 0.1275 5.9063 1.8485 6.5254 71.5905 6.4112 0.6153 0.1349 1.3787 0.1263 38.7117 55.2740 5.9337 6.1770 167.5002 23.2407 2.7969 10.6731 0.5395 10.3260 0.3724 5.4684 0.0830 0.1576 3.7788 5.8849 9.7156 0.6110 11.2474 0.3008 0.0647 0.0369 0.0318 10.0938 3.6386 4.1610 2.4075 15.7597 12.9899 0.2983 2.3049 9.4067 10.5082 1.4848 33.3313 3.4973 15.7405 41.1292 0.2402 100.0886 1.4424 0.4742 3.5292 224.3207 107.0054 33.5556 42.6487 70.2211 7.0898 1.2275 2.2039 6.2876 20.2246 2.9092 116.7817 30.9335 79.5550 0.0249 814.6691 688.9745 141.0842 6.1311 0.5740 62.3996 84.6593 21.6010 61.7945 255.6103 133.7203 5.3408 14.5445 27.7201 18.3893 0.6849 0.5599 0.7686 18.2603 19.8733 26.6073 64.9245 22.9524 39.7277 5.9734 1.2296 20.3397 57.1644 1.8382 4.9969 46.5965
temp: 298.150 k
press: 1.00000 atm
elementType: 7 7 6 6 6 6 6 6 6 6 6 6 6 6 6 6 6 6 6 6 6 6 6 6 6 6 6 6 1 1 1 1 1 1 1 1 1 1 1 1 1 1 1 1 1 1 1 1
symmnumber: 1
zpe: 1005428.1 jmol-1
zpe.correction: 0.382947 hartree
zpe.thermalcorrener: 0.404668 hartree
zpe.thermalcorrenthalpy: 0.405613 hartree
zpe.thermalcorrgfe: 0.330059 hartree
zpe.sumelectzpe: -1110.418268 hartree
zpe.sumelectthermal: -1110.396547 hartree
zpe.sumelectthermalent: -1110.395602 hartree
zpe.sumelectthermalfe: -1110.471156 hartree
dipole: 0.0000 -2.9613 0.0711
dipole: 2.9621
quadrupole: -147.0446 -134.6664 -173.9283
quadrupole: -0.0006 0.0030 -0.9673
quadrupole: 4.8352 17.2134 -22.0485 -0.0006 0.0030 -0.9673
hfenergy: -1110.801215 hartree
pointgroup: C01 [X(C26H20N2)]
dipole: 0.0000385 -1.1652822 -0.0164371 debye
polarizability: 548.6006306|0.0042583|403.5747818|-0.0044448|-5.6718064|130.0918016 unknown
InChI: InChI=1S/C26H20N2/c1-3-7-21-17-25(11-9-19(21)5-1)27-23-13-15-24(16-14-23)28-26-12-10-20-6-2-4-8-22(20)18-26/h1-18,27-28H
charge 0 multiplicity 1
48 atoms
N  -2.850691 -2.283058 -0.06137
N  2.851078 -2.282876 -0.061106
C  -3.804936 -1.248544 0.028815
C  3.805197 -1.248209 0.028901
C  -4.560417 1.094848 -0.144672
C  4.560322 1.095259 -0.145078
C  -5.908763 0.703348 0.215896
C  5.908698 0.70404 0.215684
C  -1.435878 -2.205509 -0.080638
C  1.436264 -2.205436 -0.080522
C  -3.531222 0.105008 -0.237478
C  3.531288 0.105236 -0.237735
C  -5.150365 -1.631759 0.382537
C  5.15064 -1.631142 0.382835
C  -6.165803 -0.685885 0.466228
C  6.165931 -0.685092 0.466371
C  -0.702618 -3.261132 -0.690273
C  0.703109 -3.261092 -0.690222
C  -0.703667 -1.159622 0.545267
C  0.703943 -1.159595 0.545331
C  -4.300454 2.481787 -0.413904
C  4.300171 2.482096 -0.41465
C  -6.932968 1.699974 0.302717
C  6.932749 1.700841 0.302348
C  -5.320022 3.432985 -0.325226
C  5.319593 3.433465 -0.326121
C  -6.648743 3.043101 0.0386
C  6.648345 3.043862 0.037893
H  -2.531861 0.417274 -0.554473
H  2.531889 0.417258 -0.554852
H  -3.236567 -3.224457 -0.149705
H  3.237079 -3.224238 -0.149285
H  -5.362515 -2.687511 0.595322
H  5.362931 -2.686809 0.595898
H  -7.18171 -0.9981 0.736154
H  7.181865 -0.997081 0.736453
H  -1.241238 -4.079355 -1.184296
H  1.241819 -4.079276 -1.184213
H  -1.233168 -0.367047 1.080897
H  1.233378 -0.366989 1.080988
H  -3.284097 2.785983 -0.692162
H  3.28379 2.786076 -0.693054
H  -7.949123 1.392528 0.579032
H  7.94893 1.393611 0.578809
H  -5.105657 4.487257 -0.53367
H  5.105086 4.487656 -0.534828
H  -7.43745 3.800163 0.106893
H  7.436936 3.801056 0.106064
