program: Gaussian 09
title: 000047826
version: EM64L-G09RevD.01
frameworkgroup: C1[X(C27H28N2O2)]
method: RPBEPBE
basis: SDD
operation: Freq
keyword: #p
keyword: freq=noraman
keyword: PBEPBE/SDD
title: #p freq=noraman PBEPBE/SDD
converged: YES YES NO NO
title: Mulliken charges:
elementType: O O N N C C C C C C C C C C C C C C C C C C C C C C C C C C C H H H H H H H H H H H H H H H H H H H H H H H H H H H H
charge: -0.417868 -0.230751 -0.509596 -0.041428 -0.366330 -0.386826 -0.387768 -0.368540 -0.577284 -0.375305 0.519526 -0.488162 -0.437842 -0.388188 0.241376 0.416563 0.227679 0.232539 -0.343590 -0.463192 -0.092268 -0.110014 0.171279 -0.381795 -0.331248 -0.310065 -0.312189 -0.265583 -0.269288 -0.235059 -0.238944 0.194584 0.191595 0.199088 0.197122 0.207557 0.213470 0.191984 0.191513 0.205333 0.208883 0.218375 0.218063 0.252126 0.252491 0.234782 0.232357 0.302849 0.264955 0.230397 0.219272 0.267589 0.265404 0.264615 0.228005 0.229573 0.231795 0.230941 0.375441
chargesum: 0.00000
title: Mulliken charges with hydrogens summed into heavy atoms:
elementType: O O N N C C C C C C C C C C C C C C C C C C C C C C C C C C C
charge: -0.042427 -0.230751 -0.206747 -0.041428 0.019849 0.009384 0.033259 0.014957 -0.163068 0.061133 0.519526 0.016456 -0.203060 -0.155831 0.241376 0.416563 0.227679 0.232539 -0.078635 -0.232795 -0.092268 -0.110014 0.171279 -0.162523 -0.063659 -0.044661 -0.047573 -0.037578 -0.039714 -0.003264 -0.008003
polarizability: 4.62155743e+02 -4.33856859e+01 3.84954652e+02 5.85758711e+01 1.96788216e+01 2.17176794e+02
1716.lowfreq: -1.7354 -0.0015 0.0005 0.0011 3.4277 3.9081 6.4214 13.1947 14.4777
frequency: 5.6830 13.1145 14.4646 30.2382 32.5492 35.7098 44.7691 50.8953 67.0192 79.3845 87.1021 96.4216 111.9400 118.2065 129.4881 135.5374 142.5879 169.0568 202.5581 217.2840 240.9050 250.8865 282.1344 293.2292 314.6441 339.5271 374.2659 380.9537 396.7471 401.3434 406.9340 434.4270 440.6940 474.8162 485.6419 495.2034 500.2114 506.3574 521.6946 528.2852 566.2579 582.9522 589.0706 592.2861 616.8485 635.8468 637.8014 639.1756 654.6015 699.1192 721.6967 729.6195 730.9826 746.4485 758.9013 759.9487 769.9293 774.8982 798.3014 816.0323 823.8219 828.3301 838.1105 856.7534 857.0512 866.8748 871.4984 879.2918 894.6347 929.6506 943.8922 959.0696 965.2176 967.3662 982.3759 992.7931 993.6745 994.0952 999.9753 1005.8758 1019.9033 1022.9809 1038.2255 1054.9300 1072.5667 1075.7182 1083.5175 1087.0789 1100.5528 1109.7376 1117.1776 1131.7865 1150.1806 1160.7290 1182.6805 1189.6081 1204.2020 1211.3040 1219.2294 1223.3073 1240.0357 1245.1160 1249.6212 1263.4736 1268.4369 1276.0607 1281.2335 1282.3305 1285.6282 1294.1836 1295.7424 1303.7313 1314.2873 1332.6358 1349.8416 1351.4344 1358.9133 1368.9262 1372.8860 1378.3270 1397.7446 1414.3409 1430.9421 1437.2120 1441.2284 1452.9800 1461.2326 1462.8388 1465.8637 1471.6532 1473.3410 1481.7164 1487.6897 1489.0960 1507.6684 1525.1205 1551.0264 1552.9255 1589.6542 1611.2806 1624.9188 1630.2306 1669.4477 2950.0155 2951.5332 2961.0251 2967.4167 2976.0323 2985.5414 2986.6420 2995.1120 2996.2203 3013.0915 3025.7044 3032.2778 3047.2462 3061.4995 3110.2795 3121.0616 3122.2158 3131.3368 3134.2184 3136.7787 3147.2739 3154.3705 3159.8951 3166.3445 3170.3095 3174.7874 3511.1093 3526.1472
redmass: 5.8264 6.8268 6.7898 4.9343 5.1536 1.9165 3.7082 4.1078 5.1991 4.1939 3.2773 1.7575 3.9640 5.8601 5.0083 2.2974 1.9253 4.4900 4.9740 4.9850 4.8074 4.7862 4.0523 4.3139 5.6487 3.7010 3.3632 3.9996 5.9016 3.5730 2.9681 4.3422 3.3757 2.9162 2.6560 1.8002 1.7822 3.1947 5.5531 2.8280 4.4560 3.8333 4.6135 6.4868 5.3721 6.1197 1.3155 5.7946 5.4954 4.8051 1.0739 3.2190 1.1568 3.4318 1.3338 1.7479 1.3935 2.2220 2.7887 1.3723 4.0619 1.4172 1.6628 4.9971 5.3788 2.2364 1.8812 2.6894 1.3729 5.4701 1.4181 1.3634 1.3635 1.3559 1.3160 1.3279 1.3502 4.2721 4.0927 2.8767 2.2882 2.0277 3.2896 2.7958 1.6332 2.2726 2.1398 3.2575 3.3578 2.0358 1.4351 1.2458 1.3369 1.1817 1.1849 1.1199 1.5248 1.2626 2.3034 1.4368 1.4327 1.3386 2.9956 2.3004 1.4650 1.2221 2.5051 1.1054 1.9180 1.0815 1.1383 1.4622 1.5254 1.5050 1.7382 2.0693 1.6594 2.4316 1.8395 4.1689 3.3171 3.3989 4.9661 1.0848 2.6691 3.0492 1.0751 1.0734 1.0915 1.5824 1.3733 1.1095 1.1763 2.4483 2.9569 6.5651 7.0404 4.8029 4.6562 5.6515 6.4337 6.4202 8.2284 1.0590 1.0589 1.0593 1.0594 1.0599 1.0614 1.0969 1.0595 1.1001 1.1011 1.1016 1.1017 1.1046 1.1032 1.0869 1.0856 1.0893 1.0859 1.0965 1.0889 1.0898 1.0948 1.0950 1.0955 1.0996 1.0985 1.0639 1.0747
irintensity: 0.6454 0.7224 0.2008 1.0013 0.2788 0.0012 0.1655 0.9483 0.0634 0.8317 0.4230 0.1907 0.3076 0.6118 6.0412 0.0189 0.1329 2.1785 0.4121 1.6567 0.4823 0.7693 0.9612 8.4739 5.7758 0.2093 12.8490 13.5802 0.6576 4.8533 0.3535 21.3857 46.0652 1.0204 9.6629 164.7825 28.4967 8.8775 3.3892 4.8667 6.1762 6.3001 20.6501 3.0454 21.0082 7.3796 128.2614 5.2848 5.6901 13.6061 17.4660 4.9931 0.2530 5.2545 31.1996 66.1758 9.7488 54.5561 4.9807 4.6633 8.6984 17.3177 31.0909 0.7613 1.1636 5.0222 3.0682 1.0566 1.6963 3.9093 0.2289 0.9628 0.7791 1.9969 0.8500 0.1357 1.7745 33.5304 63.6045 5.4810 1.8715 12.5175 122.2503 79.0151 1.2980 6.4273 4.1047 9.5278 13.2364 0.3030 2.8033 15.3255 14.9591 0.0727 0.5002 3.9135 1.6278 41.5295 3.4894 1.1617 1.4344 0.2969 15.1252 22.9831 12.1224 0.4405 8.5052 0.6785 2.0775 0.0101 0.0427 15.1914 8.4636 20.9589 3.1437 31.1553 4.3654 13.0229 36.0861 120.8603 22.3387 1.8035 136.4013 27.1682 20.4915 6.3391 0.1043 0.1962 0.7815 8.7727 1.1192 4.5412 37.2649 178.2881 358.7527 44.3624 84.2152 16.5085 11.2410 16.6602 46.5649 10.1114 203.4087 0.0589 13.4656 45.1900 4.6104 103.0753 5.7452 2.9864 39.5217 0.7394 4.5610 9.0323 5.2989 85.2603 90.4914 22.3360 1.9846 22.9887 6.4847 22.1692 13.8214 11.8076 23.3534 7.1593 15.3932 34.4974 21.8078 18.5780 15.9304
temp: 298.150 k
press: 1.00000 atm
elementType: 8 8 7 7 6 6 6 6 6 6 6 6 6 6 6 6 6 6 6 6 6 6 6 6 6 6 6 6 6 6 6 1 1 1 1 1 1 1 1 1 1 1 1 1 1 1 1 1 1 1 1 1 1 1 1 1 1 1 1
symmnumber: 1
zpe: 1268268.2 jmol-1
zpe.correction: 0.483058 hartree
zpe.thermalcorrener: 0.511698 hartree
zpe.thermalcorrenthalpy: 0.512643 hartree
zpe.thermalcorrgfe: 0.417014 hartree
zpe.sumelectzpe: -1303.445361 hartree
zpe.sumelectthermal: -1303.416721 hartree
zpe.sumelectthermalent: -1303.415776 hartree
zpe.sumelectthermalfe: -1303.511405 hartree
dipole: 3.0355 -1.1010 1.6630
dipole: 3.6321
quadrupole: -197.4831 -175.1910 -177.9143
quadrupole: -16.9464 -4.4950 5.2208
quadrupole: -13.9536 8.3385 5.6151 -16.9464 -4.4950 5.2208
hfenergy: -1303.9284189 hartree
pointgroup: C01 [X(C27H28N2O2)]
dipole: -1.164223 -0.6436879 -0.5217608 debye
polarizability: 456.3297911|60.42884|374.0863993|47.441364|-53.2323941|233.8709985 unknown
InChI: InChI=1S/C27H28N2O2/c30-26(31)15-5-3-1-2-4-10-20-16-18-21(19-17-20)28-27-22-11-6-8-13-24(22)29-25-14-9-7-12-23(25)27/h6-9,11-14,16-19,28,30H,1-5,10,15H2
charge 0 multiplicity 1
59 atoms
O  -12.283787 -0.062676 0.789643
O  -10.942974 1.680805 0.047839
N  2.793386 0.273564 -1.361928
N  6.38515 0.926306 0.927534
C  -4.902603 -1.522908 0.165567
C  -6.025068 -0.470673 0.023021
C  -3.503279 -0.963158 -0.171961
C  -7.424984 -1.01717 0.382431
C  -2.378938 -2.030658 -0.061712
C  -8.540366 0.038127 0.21819
C  -1.001903 -1.472443 -0.387255
C  -9.927116 -0.51849 0.591305
C  -0.085096 -1.116288 0.634692
C  -0.605962 -1.244286 -1.731216
C  3.942177 0.464034 -0.565468
C  1.557195 -0.334658 -1.006996
C  4.57307 1.754519 -0.568953
C  4.549838 -0.60009 0.182054
C  1.172549 -0.549663 0.342857
C  0.652031 -0.692664 -2.043203
C  5.816845 1.920538 0.174634
C  5.761649 -0.295617 0.939784
C  -11.042398 0.496126 0.434399
C  4.023646 2.89742 -1.248892
C  4.073158 -1.957592 0.171924
C  6.481147 3.197242 0.14338
C  6.377534 -1.340218 1.716719
C  4.689402 4.121929 -1.249366
C  4.7104 -2.946514 0.917377
C  5.939759 4.269713 -0.558685
C  5.8635 -2.632494 1.714495
H  -4.898859 -1.919087 1.202834
H  -5.122795 -2.387216 -0.49613
H  -5.794956 0.400854 0.670489
H  -6.037625 -0.087902 -1.018719
H  -3.507502 -0.54719 -1.200067
H  -3.265823 -0.116859 0.503756
H  -7.414086 -1.38711 1.429323
H  -7.649143 -1.89725 -0.256609
H  -2.623347 -2.867918 -0.746589
H  -2.384197 -2.44832 0.96417
H  -8.317987 0.921664 0.846856
H  -8.56061 0.404829 -0.826022
H  -10.18368 -1.400436 -0.028529
H  -9.943878 -0.879363 1.638755
H  -0.363723 -1.275886 1.683691
H  -1.287238 -1.515545 -2.547469
H  2.775367 0.801976 -2.236552
H  1.849105 -0.268172 1.15551
H  0.944308 -0.54866 -3.091013
H  3.047384 2.822857 -1.742092
H  3.202151 -2.217179 -0.435052
H  7.419371 3.280158 0.700474
H  7.270743 -1.068988 2.287773
H  4.250161 4.983774 -1.763568
H  4.334617 -3.975171 0.89077
H  6.454106 5.236899 -0.572604
H  6.344976 -3.419791 2.305061
H  -12.9940 0.62627 0.676243
