program: Gaussian 09
title: 000047724
version: EM64L-G09RevD.01
frameworkgroup: C1[X(C12H19NO2)]
method: RPBEPBE
basis: SDD
operation: Freq
keyword: #p
keyword: freq=noraman
keyword: PBEPBE/SDD
title: #p freq=noraman PBEPBE/SDD
converged: NO YES NO NO
title: Mulliken charges:
elementType: O O N C C C C C C C C C C C C H H H H H H H H H H H H H H H H H H H
charge: -0.433775 -0.426258 -0.055110 0.357649 -0.114057 -0.096310 -0.104292 -0.547223 -0.517884 -0.541262 -0.453372 -0.451120 -0.453281 0.046503 -0.432149 0.200133 0.202084 0.200085 0.209180 0.204680 0.194465 0.219880 0.225284 0.214833 0.193718 0.201452 0.198328 0.197115 0.197299 0.197505 0.192951 0.259167 0.347440 0.366343
chargesum: 0.00000
title: Mulliken charges with hydrogens summed into heavy atoms:
elementType: O O N C C C C C C C C C C C C
charge: -0.086335 -0.059915 -0.055110 0.357649 0.086077 0.105773 0.095793 -0.133362 -0.103540 -0.101144 -0.058203 -0.055677 -0.058477 0.046503 0.019969
polarizability: 1.59581293e+02 -9.04178943e+00 1.30581282e+02 -4.35507538e-01 1.88739170e+00 1.13709502e+02
1716.lowfreq: -31.3533 -9.6429 0.0006 0.0007 0.0007 20.0582 41.8134 97.6931 118.9176
frequency: 40.3841 97.6514 118.8063 138.4637 221.6009 226.8930 272.1783 276.5122 301.7069 309.9560 342.0875 360.3781 382.6565 397.5593 416.5569 422.0099 437.6128 449.1692 450.9580 623.4857 636.5117 641.4688 662.7855 719.4743 767.1649 806.8449 809.7354 833.8211 869.4599 869.9770 879.9385 885.6646 928.8227 935.0546 940.4324 959.8676 964.7484 976.5248 978.5237 1038.8730 1043.4669 1050.2310 1052.2994 1100.8709 1102.7816 1106.9443 1109.1973 1113.1121 1144.8870 1178.0040 1183.2565 1210.9072 1249.1078 1259.5461 1282.6935 1284.6601 1292.4138 1295.7119 1300.3611 1310.2296 1317.2850 1324.3870 1332.0379 1339.1280 1342.3059 1351.4658 1358.6503 1360.5705 1374.0696 1450.0774 1452.6264 1461.2748 1463.9905 1464.7998 1470.4933 1484.4326 1583.1548 2942.9009 2962.3089 2963.8424 2964.6293 2967.4823 2978.4237 2984.7021 2992.8271 2996.1120 3002.8034 3007.0652 3019.9275 3022.0586 3029.0230 3030.5678 3050.5887 3111.4405 3557.0632 3567.3777
redmass: 5.1119 3.7048 4.5026 3.5876 1.7905 2.3290 3.6420 2.9386 2.0605 2.5054 2.5890 3.0463 3.5852 4.3983 2.2306 1.5097 1.4735 2.4932 1.7457 4.0860 3.7700 3.8482 5.1641 4.2995 3.7080 2.7403 2.8507 5.2445 1.5982 1.5927 1.5706 4.9068 2.8968 2.7382 2.4858 1.9569 2.2263 2.1421 2.1600 2.6160 2.5093 1.7668 1.8721 1.4185 1.3821 1.2758 1.0925 1.0385 1.3475 1.2665 1.1948 1.6012 1.4497 1.6800 1.7627 1.8395 1.8481 1.6071 1.6316 1.5641 1.5320 1.3148 1.6920 1.4651 1.4488 1.4788 1.5577 1.5818 1.1845 1.0819 1.0819 1.0873 1.0890 1.0908 1.0882 1.0910 7.1358 1.0582 1.0642 1.0610 1.0614 1.0607 1.0691 1.0679 1.0831 1.0797 1.1028 1.0816 1.1029 1.1028 1.1021 1.1021 1.1008 1.0937 1.0661 1.0675
irintensity: 0.5420 2.0681 0.0438 1.2670 34.0969 51.9371 7.0393 12.6743 2.9816 2.5706 16.0381 14.9292 0.3320 5.0231 3.8460 50.9602 67.7386 8.0868 2.1619 15.9180 2.6588 4.5023 4.8030 8.7931 1.5859 1.2177 6.1681 59.0410 0.7687 0.1517 0.6027 79.5212 14.3147 61.2077 16.9821 28.9713 1.8854 31.9180 0.5165 1.9844 0.4769 0.0713 0.7940 4.1941 1.9293 2.8089 1.5979 0.4507 37.3068 7.3072 5.7305 49.1144 0.3862 0.3058 0.1589 1.3505 1.2317 22.4320 17.8107 2.2811 11.5917 0.0562 9.7553 2.5773 4.3726 2.3407 0.0512 2.1062 13.3463 0.0777 3.4760 5.4356 13.1274 15.6343 26.8583 1.5619 1.2314 45.2711 16.6033 24.3843 26.8574 33.4612 38.0074 40.6808 143.3030 149.8200 34.7389 33.9169 3.4294 21.7476 101.4485 46.6898 35.0527 6.0203 4.3381 48.7013
temp: 298.150 k
press: 1.00000 atm
elementType: 8 8 7 6 6 6 6 6 6 6 6 6 6 6 6 1 1 1 1 1 1 1 1 1 1 1 1 1 1 1 1 1 1 1
symmnumber: 1
zpe: 772458.0 jmol-1
zpe.correction: 0.294214 hartree
zpe.thermalcorrener: 0.307581 hartree
zpe.thermalcorrenthalpy: 0.308525 hartree
zpe.thermalcorrgfe: 0.255273 hartree
zpe.sumelectzpe: -672.645736 hartree
zpe.sumelectthermal: -672.632369 hartree
zpe.sumelectthermalent: -672.631424 hartree
zpe.sumelectthermalfe: -672.684676 hartree
dipole: -2.9700 -0.4972 0.3689
dipole: 3.0339
quadrupole: -99.4901 -88.4496 -88.5129
quadrupole: -8.5684 1.3899 0.3077
quadrupole: -7.3392 3.7012 3.6380 -8.5684 1.3899 0.3077
hfenergy: -672.9399499 hartree
pointgroup: C01 [X(C12H19N1O2)]
dipole: -1.1715147 -0.1551619 0.1679497 debye
polarizability: 159.4542502|-9.0323127|130.6839539|2.0885435|-1.908656|113.7338729 unknown
InChI: InChI=1S/C12H19NO2/c14-7-11(13-15)12-4-8-1-9(5-12)3-10(2-8)6-12/h8-10,14-15H,1-7H2
charge 0 multiplicity 1
34 atoms
O  3.0366 1.723701 -0.81595
O  3.764992 -1.286488 0.32276
N  2.308699 -1.347211 0.120708
C  0.228416 -0.099063 0.075208
C  -1.738849 1.114655 -1.03256
C  -1.935705 0.347723 1.376084
C  -1.922847 -1.353211 -0.499387
C  -0.191325 1.019093 -0.937762
C  -0.389462 0.246491 1.476011
C  -0.377959 -1.452458 -0.40216
C  -2.31958 1.461466 0.36503
C  -2.313013 -0.244319 -1.512744
C  -2.513119 -1.009402 0.895534
C  1.755176 -0.15496 0.206489
C  2.542253 1.128448 0.445591
H  -2.006334 1.911175 -1.754988
H  -2.344261 0.594975 2.375961
H  -2.323933 -2.327268 -0.842561
H  0.230373 0.788008 -1.938132
H  0.207944 2.002834 -0.613389
H  0.021014 1.2039 1.855725
H  -0.104503 -0.542657 2.199175
H  -0.086606 -2.255683 0.299265
H  0.055024 -1.723349 -1.384592
H  -1.929185 2.440877 0.709453
H  -3.422199 1.553311 0.303261
H  -3.415756 -0.177888 -1.602724
H  -1.915731 -0.490348 -2.518099
H  -2.261359 -1.808644 1.621154
H  -3.618842 -0.953573 0.838855
H  1.922663 1.859738 1.002457
H  3.456509 0.913754 1.017565
H  2.264675 1.876628 -1.418844
H  4.022831 -2.238354 0.221104
