program: Gaussian 09
title: 000046610
version: EM64L-G09RevD.01
frameworkgroup: C1[X(C18H23N2O2)]
method: RPBEPBE
basis: SDD
operation: Freq
keyword: #p
keyword: freq=noraman
keyword: PBEPBE/SDD
title: #p freq=noraman PBEPBE/SDD
converged: NO YES NO NO
title: Mulliken charges:
elementType: O O N N C C C C C C C C C C C C C C C C C C H H H H H H H H H H H H H H H H H H H H H H H
charge: -0.321874 -0.286024 -0.222760 -0.360590 -0.571869 0.387271 -0.592107 -0.626603 0.327011 0.488070 -0.425710 -0.336818 0.328106 -0.836880 -0.354565 -0.394538 -0.417816 -0.224147 -0.226103 -0.217808 0.312721 -0.601633 0.266342 0.271254 0.292787 0.254958 0.279736 0.284077 0.249380 0.304521 0.332474 0.252216 0.267278 0.222061 0.258241 0.249277 0.238838 0.280738 0.248162 0.250346 0.253991 0.348097 0.249670 0.248668 0.271553
chargesum: 1.00000
title: Mulliken charges with hydrogens summed into heavy atoms:
elementType: O O N N C C C C C C C C C C C C C C C C C C
charge: -0.321874 -0.286024 -0.222760 -0.012493 -0.034273 0.387271 0.235373 0.211376 0.327011 0.488070 -0.093235 -0.084602 0.328106 -0.089301 -0.105287 -0.155700 -0.137078 0.024015 0.024242 0.036183 0.312721 0.168258
polarizability: 2.27450513e+02 -2.60278227e+01 2.18658953e+02 2.18035739e+01 1.67955868e+01 1.85027164e+02
1716.lowfreq: -11.3287 -0.0006 0.0002 0.0004 2.0158 7.2024 20.5823 20.8826 32.4759
frequency: 20.4596 20.8436 32.1564 52.9869 65.8085 72.9530 89.3718 103.2307 109.7979 147.5108 169.0060 193.3611 198.7996 215.9295 240.3379 255.8232 268.1721 290.0550 316.5187 336.6849 345.1346 354.5184 358.0653 366.3303 397.3288 404.3024 431.5162 461.0362 476.7020 513.2176 541.7230 568.2434 582.7656 616.7482 623.9571 634.6704 654.3269 678.9994 697.6811 707.6528 709.5252 739.4478 746.8893 790.5325 824.3546 838.0422 839.1303 858.4996 862.0633 908.9815 917.2372 937.5764 954.7523 970.4842 971.6598 987.2997 990.9650 996.2512 1013.8473 1027.3844 1038.5796 1053.8610 1064.7031 1089.4428 1097.6761 1125.8778 1130.4146 1148.2735 1158.6066 1170.6951 1177.1825 1182.7785 1191.6507 1194.7253 1210.0826 1223.7835 1231.9917 1268.2284 1304.1189 1331.9986 1341.3685 1352.4381 1388.5500 1411.0877 1413.7324 1419.7259 1434.9489 1442.3210 1444.4307 1454.1371 1458.7113 1462.0794 1471.5149 1480.6885 1483.2995 1485.1281 1490.7849 1492.0157 1501.3554 1513.8055 1516.4133 1568.9191 1592.5563 1611.0579 1624.2962 1713.5567 2986.1844 2998.8733 3033.8008 3037.5579 3041.6066 3068.1060 3084.9200 3094.7518 3119.5463 3127.8753 3131.7215 3134.5195 3138.8763 3145.1057 3147.2714 3148.9766 3161.7073 3167.7676 3176.9875 3183.3171 3191.7389 3215.7905 3564.8522
redmass: 4.0078 5.1831 2.7643 4.5883 3.9959 1.3700 4.2351 3.7782 3.3809 1.5646 2.1495 2.8433 4.0220 2.5747 1.7176 3.4593 1.9575 4.8186 3.1495 3.9539 4.0947 2.6195 2.2546 1.6122 2.4202 2.7335 2.8414 3.1668 3.0611 3.1653 4.2319 3.9739 5.0228 6.1932 1.3670 2.6017 6.2260 10.0327 4.2983 2.7503 2.5292 2.5131 4.4404 2.5714 3.8193 1.6458 2.5734 1.3089 3.1999 2.1434 2.2246 1.4387 2.0816 2.0419 1.3533 1.4533 5.0642 1.4516 1.3381 2.2198 1.5428 4.6518 3.0410 1.4425 1.3957 1.2888 1.7108 1.7061 1.2893 2.1874 1.4839 1.0587 1.6416 1.1115 2.0510 2.6733 3.8755 1.6072 1.4053 1.2854 1.4077 3.2371 7.5107 1.2811 1.6770 1.7071 1.1655 1.2279 1.9730 1.0763 1.2714 1.1074 1.1406 1.0417 1.1362 1.9522 1.3917 1.2495 1.0949 1.1512 1.4483 6.5098 5.8776 6.0213 6.6971 9.1927 1.0415 1.0348 1.0338 1.0408 1.0580 1.0941 1.1032 1.0979 1.0901 1.1000 1.0921 1.0968 1.1049 1.1040 1.0903 1.0900 1.0955 1.1053 1.1014 1.0964 1.1003 1.0910 1.0775
irintensity: 0.4429 0.1052 6.2384 1.7459 0.0346 2.2131 3.2164 1.6326 0.8789 0.0847 0.6879 0.2783 2.7810 1.5414 0.1604 2.5039 0.1288 1.7384 9.2836 3.8730 17.6742 1.4653 6.5360 1.0642 1.5357 0.5751 1.5970 1.4257 5.9530 10.2718 1.3740 6.8711 7.4892 0.0039 95.4556 19.9630 2.6236 30.7444 5.2448 23.8950 52.6734 73.7532 17.6945 9.6204 5.4679 10.9908 47.9799 4.3114 49.1190 28.8583 66.6032 4.0466 26.2825 3.4758 0.0714 0.2872 2.0618 9.9321 0.0447 1.5864 24.1697 146.9903 96.2123 3.7006 6.9866 0.0301 10.6463 143.3273 4.3172 278.7276 53.4468 0.3575 2.6811 2.1896 56.1625 26.6169 32.2451 20.7119 59.8875 3.1522 14.7980 8.8359 0.6148 12.5917 15.5442 16.6520 31.1239 43.0225 10.7619 3.0515 201.2600 3.7976 1.7886 17.8436 38.1138 2.7331 168.4133 108.8025 15.6790 60.2140 85.0320 5.9579 1.9475 5.2375 84.9769 298.3170 25.2608 44.6081 1.3614 3.3298 21.5246 18.0376 19.4092 17.2816 7.8923 3.0862 4.3804 3.3023 0.0941 14.1507 5.6732 2.5002 13.7592 1.0534 7.7593 0.3939 2.0039 32.7015 71.2707
temp: 298.150 k
press: 1.00000 atm
elementType: 8 8 7 7 6 6 6 6 6 6 6 6 6 6 6 6 6 6 6 6 6 6 1 1 1 1 1 1 1 1 1 1 1 1 1 1 1 1 1 1 1 1 1 1 1
symmnumber: 1
zpe: 990299.2 jmol-1
zpe.correction: 0.377185 hartree
zpe.thermalcorrener: 0.399083 hartree
zpe.thermalcorrenthalpy: 0.400028 hartree
zpe.thermalcorrgfe: 0.324773 hartree
zpe.sumelectzpe: -957.803525 hartree
zpe.sumelectthermal: -957.781627 hartree
zpe.sumelectthermalent: -957.780683 hartree
zpe.sumelectthermalfe: -957.855938 hartree
dipole: 2.5145 -2.4217 1.8904
dipole: 3.9700
quadrupole: -72.1280 -98.7677 -107.4568
quadrupole: -10.4347 15.3342 -0.2616
quadrupole: 20.6562 -5.9835 -14.6726 -10.4347 15.3342 -0.2616
hfenergy: -958.1807104 hartree
pointgroup: C01 [X(C18H23N2O2)]
dipole: -1.0592559 1.0003419 0.5629401 debye
polarizability: 231.3576948|-26.2925341|213.2153767|-15.3079976|-22.4275488|186.5635596 unknown
InChI: InChI=1S/C18H23N2O2/c1-14-10-11-16(22-18(21)19-2)12-17(14)20(3,4)13-15-8-6-5-7-9-15/h5-12,19H,13H2,1-4H3
charge 1 multiplicity 1
45 atoms
O  2.968883 0.696556 -0.481465
O  2.72082 -0.570213 1.539611
N  -1.774761 0.929152 1.099525
N  4.757989 -0.383534 0.376766
C  -2.872036 0.017206 0.395967
C  -0.693712 1.364192 0.092829
C  -2.46194 2.155443 1.712134
C  -1.205614 0.134617 2.277306
C  -0.982517 2.246865 -0.993627
C  -2.36215 -1.315853 -0.093208
C  0.595016 0.826407 0.293115
C  0.113815 2.542472 -1.854459
C  1.64815 1.166464 -0.584996
C  -2.292347 2.954944 -1.332178
C  -1.732717 -1.430056 -1.361323
C  -2.565652 -2.486563 0.685553
C  1.407359 2.029382 -1.673435
C  -1.295333 -2.687082 -1.82966
C  -2.131113 -3.744628 0.215201
C  -1.490758 -3.845498 -1.041804
C  3.435388 -0.150431 0.596607
C  5.572163 -1.214567 1.275909
H  -3.266741 0.628076 -0.426925
H  -3.657451 -0.10198 1.162426
H  -3.041019 2.686056 0.950053
H  -3.136175 1.81688 2.513939
H  -1.686727 2.818512 2.124007
H  -0.462513 0.747752 2.807256
H  -2.043879 -0.101893 2.950678
H  -0.755512 -0.80144 1.925637
H  0.837585 0.148243 1.107582
H  -0.066978 3.214867 -2.699833
H  -2.269515 3.275386 -2.386453
H  -3.203875 2.345296 -1.215324
H  -2.424364 3.87439 -0.730411
H  -1.5924 -0.540179 -1.985798
H  -3.084037 -2.420922 1.650717
H  2.222548 2.285398 -2.355091
H  -0.815925 -2.766828 -2.810585
H  -2.300298 -4.642023 0.818659
H  -1.15899 -4.821626 -1.410444
H  5.183346 0.04657 -0.446387
H  6.406617 -0.629007 1.699488
H  5.979874 -2.088386 0.738271
H  4.933095 -1.569319 2.098669
