program: Gaussian 09
title: 000047700
version: EM64L-G09RevD.01
frameworkgroup: C1[X(C7H8N2O4)]
method: RPBEPBE
basis: SDD
operation: Freq
keyword: #pfreq=noraman
keyword: PBEPBE/SDD
title: #p freq=noraman PBEPBE/SDD
converged: YES YES NO NO
title: Mulliken charges:
elementType: O O O O N N C C C C C C C H H H H H H H H
charge: -0.257690 -0.316635 -0.329573 -0.377894 -0.372345 -0.305977 -0.467828 0.205544 0.218067 -0.325965 0.273854 -0.246061 -0.142415 0.264983 0.250657 0.344286 0.286433 0.263224 0.267863 0.394187 0.373284
chargesum: 0.00000
title: Mulliken charges with hydrogens summed into heavy atoms:
elementType: O O O O N N C C C C C C C
charge: -0.257690 -0.316635 -0.329573 -0.004610 -0.028060 0.088211 0.047813 0.205544 0.218067 -0.039531 0.273854 0.017163 0.125448
polarizability: 1.53251275e+02 5.29303270e+00 1.04583027e+02 -6.16409725e+00 5.72430923e+00 6.18724093e+01
1716.lowfreq: -0.0006 -0.0004 0.0002 2.4641 8.1611 10.6227 41.2877 58.4031 70.8714
frequency: 41.2399 58.3968 70.8398 118.4971 142.4709 156.2453 207.8467 238.5491 266.7463 303.2001 357.2350 427.1206 468.4509 494.9037 577.3305 587.4024 594.6157 601.7989 698.3790 721.3284 742.1347 746.0950 784.6920 844.4335 869.4772 874.1979 904.3249 907.1478 953.7154 992.9062 1013.3246 1039.1086 1050.1326 1128.5599 1154.0476 1206.5105 1229.5676 1264.1481 1294.8230 1330.7051 1359.5795 1361.0252 1434.9271 1462.3924 1490.6654 1501.5823 1562.2260 1586.9894 1598.9383 3018.9865 3117.9104 3229.4452 3247.6629 3269.6157 3273.6564 3378.6572 3547.2697
redmass: 6.9278 6.9239 6.0432 6.0975 5.6949 5.5007 7.6998 5.3643 4.9400 6.7585 4.0776 3.3316 2.3638 1.8999 2.2091 3.0431 2.0630 2.8551 4.6698 2.7880 1.5077 1.3491 3.5257 1.3327 6.5803 4.5140 1.3932 3.9645 3.1472 2.8189 1.9167 3.1921 3.6671 1.6589 3.8568 1.4995 1.5675 1.3935 2.4406 1.2747 1.6539 2.5602 1.1381 3.3766 2.0379 2.1227 6.8985 5.5463 5.5926 1.0639 1.0998 1.0916 1.0996 1.1093 1.0639 1.0890 1.0786
irintensity: 2.1988 0.2983 2.3128 4.9337 8.3382 4.2511 1.6611 25.0296 8.0892 3.3010 19.4386 3.2541 35.5718 100.9207 53.3568 17.2758 20.7629 71.8805 22.3146 59.1438 112.5627 138.8025 13.8761 17.6056 15.0476 16.5129 0.6037 62.3796 8.2279 29.6083 39.1472 39.0416 20.7298 0.4235 45.6798 5.3921 11.6978 40.6013 97.9502 1.7035 176.9332 2.1958 19.9056 39.8318 64.6260 131.6300 53.5604 305.7323 126.3601 17.1392 3.0998 1.7478 1.7498 0.0191 10.8437 306.2991 40.9660
temp: 298.150 k
press: 1.00000 atm
elementType: 8 8 8 8 7 7 6 6 6 6 6 6 6 1 1 1 1 1 1 1 1
symmnumber: 1
zpe: 400175.9 jmol-1
zpe.correction: 0.152419 hartree
zpe.thermalcorrener: 0.164531 hartree
zpe.thermalcorrenthalpy: 0.165476 hartree
zpe.thermalcorrgfe: 0.112959 hartree
zpe.sumelectzpe: -680.926920 hartree
zpe.sumelectthermal: -680.914808 hartree
zpe.sumelectthermalent: -680.913864 hartree
zpe.sumelectthermalfe: -680.966381 hartree
dipole: 5.8484 -1.8461 0.4071
dipole: 6.1463
quadrupole: -71.8041 -75.0864 -76.6264
quadrupole: -0.5262 -7.7389 -2.1407
quadrupole: 2.7015 -0.5807 -2.1208 -0.5262 -7.7389 -2.1407
hfenergy: -681.0793393 hartree
pointgroup: C01 [X(C7H8N2O4)]
dipole: -2.3118053 0.5568058 0.4392181 debye
dipolederiv: -0.3663268 -0.1671605 -0.1362879 -0.1533802 -0.484742 -0.1705469 -0.1430612 -0.1802241 -0.2272422 -0.9780799 0.2339878 -0.0236063 0.1920889 -0.8940972 -0.0661147 0.0070537 -0.0343853 -0.4150904 -0.8315326 -0.4097024 -0.0806771 -0.2839161 -0.7884121 -0.1897286 0.2135263 0.0625261 -0.4352226 -0.5115554 0.2356648 0.1846783 0.0564398 -0.1924488 0.0528711 0.219028 -0.1133878 -0.4968192 -0.8194364 -0.1783937 -0.0800928 -0.4574427 -0.6061599 -0.2145798 -0.1903421 -0.1512661 -0.5999269 -0.2073293 -0.1518665 -0.2697387 -0.1407634 -0.6333367 -0.1296382 -0.2898073 0.0260958 -0.0816692 0.4270718 -0.0482448 0.1301498 -0.0388916 0.1922838 -0.0534094 0.2422156 0.0058468 0.239204 -0.613579 0.1237719 -0.159945 -0.0095677 0.265454 0.0894046 -0.2421018 0.1276327 -0.0489581 1.6708487 -0.0469506 0.3945515 0.0727535 1.1310184 0.2746358 0.4728971 0.2195663 0.4832688 0.2004771 -0.1424892 0.0639993 -0.0445862 0.0052516 0.0262243 0.1130887 -0.0052136 -0.0935672 0.6817934 0.4759505 -0.0351853 0.4915174 1.0094623 0.3596799 -0.2441789 0.18159 0.3056784 -0.0652118 0.0358923 0.0689263 0.1959681 -0.1913394 0.0583068 0.1136547 0.0156827 -0.1530484 -0.0300612 0.1312087 0.0944084 0.0672741 0.217856 0.1253107 0.0490331 0.1503217 -0.0288084 -0.0108558 -0.0131143 0.0249352 0.042763 -0.0039006 0.1326237 -0.0083226 0.0212163 0.0373499 0.0215515 -0.0086689 -0.0108808 -0.0247552 0.0126689 -0.1034791 -0.011641 -0.05953 0.063205 0.1687625 0.0150408 -0.0574028 0.0655916 0.2001853 -0.0060961 -0.0504329 -0.0094022 0.3156195 0.1441633 0.042554 -0.0069721 0.0399175 0.0562053 -0.0339638 -0.0049095 -0.031008 0.1783147 0.0070433 -0.0145082 -0.0720231 -0.018166 0.1339338 -0.029212 -0.0767667 -0.0268764 0.1640275 0.08812 0.0325235 -0.0352328 0.0453393 0.0547638 -0.0355544 -0.0304375 -0.0403059 0.1941853 0.681478 -0.0740065 0.0048211 0.0609592 0.315415 -0.0728309 -0.0527189 -0.0754696 0.2448368 0.3426586 -0.0714889 0.0015747 -0.1591432 0.1999384 -0.013903 -0.0857768 -0.0834094 0.3546629 unknown
polarizability: 152.4719671|-0.5115399|97.0339374|11.6486455|17.1168571|70.2008066 unknown
InChI: InChI=1S/C7H8N2O4/c10-6(9-12)4-8-7(11)5-2-1-3-13-5/h1-3,8-9,12H,4H2
charge 0 multiplicity 1
21 atoms
O  -2.1971 1.015164 0.2354
O  0.282609 -1.676697 0.274912
O  3.772529 1.214845 0.30554
O  3.821394 -0.898858 -1.360619
N  0.401612 0.540594 0.997178
N  2.840799 -0.792016 -0.315703
C  1.762094 0.393969 1.541024
C  -1.65185 -0.276272 0.011389
C  -0.26462 -0.527511 0.431341
C  -2.604231 -1.079445 -0.599845
C  2.862825 0.324779 0.466423
C  -3.793412 -0.277862 -0.766755
C  -3.511451 0.979963 -0.255502
H  1.7990 -0.518952 2.163179
H  1.989136 1.268762 2.168832
H  -0.064628 1.449686 1.035999
H  -2.453656 -2.117505 -0.886526
H  -4.735087 -0.592285 -1.211377
H  -4.075612 1.9038 -0.161978
H  2.092935 -1.50474 -0.325213
H  4.367213 -0.062417 -1.202299
