program: Gaussian 09
title: 000047695
version: EM64L-G09RevD.01
frameworkgroup: C1[X(C16H23N3O)]
method: RPBEPBE
basis: SDD
operation: Freq
keyword: #p
keyword: freq=noraman
keyword: PBEPBE/SDD
title: #p freq=noraman PBEPBE/SDD
converged: YES YES NO NO
title: Mulliken charges:
elementType: O N N N C C C C C C C C C C C C C C C C H H H H H H H H H H H H H H H H H H H H H H H
charge: -0.300092 -0.069982 -0.125407 -0.413335 -0.358093 -0.370035 -0.394350 -0.388753 -0.398656 -0.330290 -0.421511 -0.393520 -0.399327 0.164559 0.101445 0.365397 -0.325772 -0.433397 -0.282230 -0.210238 0.169191 0.199352 0.222765 0.163690 0.188902 0.207070 0.206458 0.192126 0.214302 0.187206 0.167510 0.253065 0.272852 0.211091 0.250375 0.214921 0.232173 0.205696 0.294611 0.273162 0.203909 0.228989 0.224174
chargesum: 0.00000
title: Mulliken charges with hydrogens summed into heavy atoms:
elementType: O N N N C C C C C C C C C C C C C C C C
charge: -0.300092 -0.069982 -0.125407 -0.118724 0.010449 0.016419 0.001621 0.009831 0.002852 0.090285 0.062432 0.071776 0.038543 0.164559 0.101445 0.365397 -0.052610 -0.229488 -0.053242 0.013936
polarizability: 2.70372000e+02 -1.23628662e+01 1.93912295e+02 -9.41546677e+00 -8.58308560e+00 1.30119019e+02
1716.lowfreq: -33.8673 -6.0596 -0.0009 -0.0006 -0.0004 5.2036 13.6814 21.1199 27.6217
frequency: -26.4683 20.5796 27.6017 60.8053 73.6361 90.7919 107.1793 135.7637 188.7409 212.8706 229.4671 244.5320 286.6733 293.3234 309.0183 355.7993 375.5377 389.0934 399.0243 404.9997 424.1855 436.2029 449.2648 469.4580 498.4164 525.2758 538.6726 580.1829 612.2004 632.7189 668.2979 684.2098 750.6553 757.7202 766.8796 770.9087 800.9591 821.6302 849.3433 850.3813 854.6032 879.2901 903.6911 920.1471 954.7429 956.9819 981.7192 991.8348 992.8233 1033.9464 1042.3611 1049.3605 1053.2064 1054.7138 1088.5650 1094.9880 1106.8343 1117.4129 1121.0944 1146.2583 1155.3320 1159.8945 1170.8899 1175.5662 1226.3159 1237.1431 1249.9950 1258.2688 1263.1336 1272.0318 1284.3138 1291.1044 1295.2681 1304.9082 1319.9050 1329.6193 1334.4227 1338.6177 1346.2898 1352.7453 1354.3257 1365.5520 1388.6648 1394.5747 1406.8019 1416.7234 1447.2805 1448.0660 1458.9980 1459.3226 1463.7537 1465.2321 1471.4358 1473.4527 1480.3816 1488.0622 1514.5067 1540.1814 1581.0154 1620.7679 2806.9277 2819.7043 2843.6044 2946.6003 2965.1140 2984.9415 2986.3991 2988.7958 3013.2490 3021.2088 3030.4632 3031.4128 3036.6462 3046.1866 3049.4091 3055.1855 3075.0165 3100.9220 3101.6979 3136.3776 3152.7306 3171.4645 3569.0668
redmass: 3.0559 4.3626 4.7142 3.3580 5.2246 3.1216 3.8686 3.8995 2.6867 3.0407 2.0818 2.6450 3.8398 3.5212 2.1575 3.0156 2.7242 2.1046 1.4205 2.7647 3.6243 3.5768 2.8928 2.9684 4.9671 3.0326 2.7035 2.3072 3.4013 5.0385 4.8421 4.2716 2.2991 2.4809 2.0584 1.3922 1.4781 4.6814 1.6706 1.5557 2.1606 2.5130 2.4237 2.8975 1.3023 1.3567 1.3457 2.7247 2.6326 2.3237 2.6820 2.1327 2.4411 2.3560 1.6438 2.5321 2.1710 2.0837 2.4601 1.3179 1.7950 2.2824 1.5332 1.1272 2.0228 1.3864 1.5313 1.3064 1.1917 2.0046 1.3909 1.3973 1.4272 1.6285 1.3142 1.3518 1.4392 1.4152 1.4975 1.4484 1.3670 1.4172 1.5814 2.0087 2.4320 2.1104 1.1299 1.0935 1.0881 1.0881 1.1810 1.0926 1.2932 1.1255 1.0996 1.9226 1.9642 4.7196 5.2715 6.1654 1.0713 1.0704 1.0703 1.0669 1.0628 1.0616 1.0611 1.0649 1.0692 1.0816 1.0966 1.0928 1.0914 1.1033 1.0861 1.1036 1.0974 1.1010 1.0878 1.0897 1.0918 1.0993 1.0767
irintensity: 0.4047 1.1320 0.5979 1.0809 4.9241 0.7151 0.4347 1.7136 0.5783 3.5640 0.2432 1.1202 2.7299 1.4868 3.3968 2.6744 8.9949 15.8638 71.7132 22.2415 6.6872 1.3787 0.1005 2.5873 0.4628 5.6428 3.0707 4.1311 0.4824 3.8847 0.4358 21.4011 67.0442 11.1115 28.5212 0.6353 0.1153 10.3013 3.1653 0.6595 10.3590 3.5591 3.8329 9.8616 3.1929 2.0314 1.1750 32.8159 4.5645 3.3379 16.0615 7.8955 10.3584 11.1219 3.6844 21.8490 62.0562 19.3336 17.2110 12.4075 5.0613 29.9999 22.2472 6.3072 51.3074 23.6888 4.1941 2.9497 6.6030 57.7393 6.3623 7.3666 0.2001 38.7421 11.4942 12.9628 22.7626 0.3519 3.0922 67.1742 2.6546 3.5806 41.0158 20.7113 37.4864 50.7512 24.3639 6.7448 11.7049 3.6654 17.4228 7.4187 66.5748 4.9286 12.5257 11.1392 104.2863 183.7535 55.0202 118.6074 56.7913 93.0493 174.3659 83.9188 40.3812 34.5216 36.2657 30.1202 24.9348 74.5238 46.0012 67.7389 21.4289 21.3759 18.9066 94.8619 31.3336 5.6641 18.3412 18.6783 9.4812 25.3888 26.1825
temp: 298.150 k
press: 1.00000 atm
elementType: 8 7 7 7 6 6 6 6 6 6 6 6 6 6 6 6 6 6 6 6 1 1 1 1 1 1 1 1 1 1 1 1 1 1 1 1 1 1 1 1 1 1 1
symmnumber: 1
zpe: 968829.0 jmol-1
zpe.correction: 0.369007 hartree
zpe.thermalcorrener: 0.386554 hartree
zpe.thermalcorrenthalpy: 0.387498 hartree
zpe.thermalcorrgfe: 0.322520 hartree
zpe.sumelectzpe: -861.459308 hartree
zpe.sumelectthermal: -861.441761 hartree
zpe.sumelectthermalent: -861.440817 hartree
zpe.sumelectthermalfe: -861.505795 hartree
dipole: -0.4229 5.9753 -0.7361
dipole: 6.0353
quadrupole: -108.4973 -115.2292 -121.4757
quadrupole: 6.9024 -1.5036 -1.1521
quadrupole: 6.5701 -0.1618 -6.4083 6.9024 -1.5036 -1.1521
hfenergy: -861.8283151 hartree
pointgroup: C01 [X(C16H23N3O1)]
dipole: 0.2076284 2.3090936 -0.5128295 debye
polarizability: 270.4715806|6.8883595|191.9089026|-14.2774813|-13.1862562|132.0228304 unknown
InChI: InChI=1S/C16H23N3O/c20-16-14-6-2-3-7-15(14)17-8-11-19(16)13-12-18-9-4-1-5-10-18/h2-3,6-7,17H,1,4-5,8-13H2
charge 0 multiplicity 1
43 atoms
O  -0.77406 -1.864869 0.360268
N  3.334941 -0.229797 0.095177
N  -0.362801 0.082433 -0.81057
N  -2.679056 2.115173 0.053247
C  4.06337 0.781209 -0.709946
C  4.0409 -0.525092 1.368644
C  5.494056 0.308665 -1.041635
C  5.469679 -1.041166 1.101316
C  6.269694 -0.026031 0.252948
C  1.906916 0.104899 0.283856
C  1.055404 -0.3325 -0.935491
C  -0.774023 1.37871 -1.367003
C  -1.279553 2.359265 -0.281461
C  -1.221444 -0.758297 -0.100903
C  -2.685211 -0.415075 0.068758
C  -3.317594 0.876027 0.154391
C  -3.50649 -1.571287 0.241533
C  -4.732018 0.92856 0.388849
C  -4.889846 -1.504058 0.459417
C  -5.505811 -0.228639 0.534437
H  4.118924 1.761585 -0.161692
H  3.50378 0.964816 -1.646236
H  3.458006 -1.287254 1.91731
H  4.100944 0.387195 2.021479
H  6.017318 1.09489 -1.619772
H  5.430961 -0.594356 -1.678919
H  5.402836 -2.004557 0.559858
H  5.977851 -1.231802 2.066285
H  7.27315 -0.425251 0.012388
H  6.422368 0.903843 0.839906
H  1.757719 1.199121 0.479358
H  1.522972 -0.440457 1.164266
H  1.094542 -1.431071 -1.003965
H  1.459831 0.093873 -1.871634
H  -1.56349 1.254133 -2.134077
H  0.107926 1.818813 -1.861964
H  -0.611409 2.271666 0.601616
H  -1.203549 3.397897 -0.655644
H  -3.272164 2.931703 0.194241
H  -2.991946 -2.536884 0.214881
H  -5.21211 1.914183 0.456935
H  -5.478633 -2.419174 0.574536
H  -6.584082 -0.140142 0.709914
