program: Gaussian 09
title: 000046593
version: EM64L-G09RevD.01
frameworkgroup: C1[X(C19H33N2O2)]
method: RPBEPBE
basis: SDD
operation: Freq
keyword: #p
keyword: freq=noraman
keyword: PBEPBE/SDD
title: #p freq=noraman PBEPBE/SDD
converged: YES YES NO NO
title: Mulliken charges:
elementType: O O N N C C C C C C C C C C C C C C C C C C C H H H H H H H H H H H H H H H H H H H H H H H H H H H H H H H H H
charge: -0.334431 -0.280666 -0.237812 -0.135107 0.252214 0.483015 -0.623476 -0.390625 -0.362652 -0.585189 -0.569905 -0.605180 -0.375445 -0.291591 -0.493616 -0.353740 0.386637 -0.464958 -0.356097 -0.689895 0.310619 -0.602078 -0.611264 0.263363 0.181378 0.198605 0.253531 0.205534 0.186966 0.297515 0.275069 0.253806 0.253605 0.278447 0.276463 0.262185 0.274329 0.279460 0.203797 0.190444 0.260829 0.318243 0.194283 0.188035 0.277321 0.195205 0.199737 0.224897 0.212327 0.209592 0.242457 0.278257 0.241496 0.240584 0.271040 0.242440
chargesum: 1.00000
title: Mulliken charges with hydrogens summed into heavy atoms:
elementType: O O N N C C C C C C C C C C C C C C C C C C C
charge: -0.334431 -0.280666 -0.237812 -0.135107 0.252214 0.483015 -0.178735 0.061511 0.029849 0.241202 0.238610 0.210794 0.018795 -0.030762 -0.175372 0.028578 0.386637 -0.187638 0.038845 -0.043080 0.310619 0.160131 0.142801
polarizability: 2.77499982e+02 -2.13326455e+01 2.72587126e+02 -1.16834872e+01 -6.61679796e+00 1.57059107e+02
1716.lowfreq: -7.4905 -0.0009 -0.0007 0.0004 4.0939 7.7099 12.0721 17.2095 22.7450
frequency: 11.8911 16.7576 22.3448 34.0790 38.8686 58.1905 78.7862 82.7207 86.3641 93.7871 108.9531 109.6730 116.8345 128.0360 129.5833 149.3697 169.0783 179.4982 201.0877 216.5412 222.0030 226.7923 246.4497 257.1481 269.3539 277.3728 323.6981 332.5533 357.4931 360.3262 385.1742 389.0194 397.5109 407.0734 438.2883 445.4551 455.8344 496.5450 521.4923 554.8816 571.0447 613.2913 619.4243 667.0033 669.9397 712.1836 721.6541 732.6926 737.9911 763.7680 783.2252 809.5196 813.2575 825.3793 890.4466 903.5679 908.6599 918.8821 923.1493 928.6055 950.3548 979.8821 985.8111 997.6776 1025.3862 1033.4568 1039.6104 1045.8306 1056.1551 1071.0433 1079.5932 1090.2488 1095.8983 1097.8183 1104.6475 1107.1105 1116.9185 1148.2533 1149.0890 1187.0447 1189.9618 1209.5539 1215.5508 1221.3075 1222.6729 1231.2721 1241.8177 1248.5346 1268.2873 1271.2863 1281.0872 1291.9193 1294.0458 1307.1228 1314.0820 1336.7893 1352.4499 1355.7978 1367.2444 1386.3635 1393.3109 1398.8995 1416.6729 1418.8563 1426.0138 1440.0179 1449.1467 1451.6470 1461.5539 1462.8840 1464.0722 1467.4482 1470.8427 1471.4369 1472.5908 1475.0512 1477.8066 1478.7926 1483.7472 1485.5483 1487.1634 1488.3014 1490.4186 1497.4850 1503.8439 1513.8840 1583.6926 1606.0420 1696.8541 2949.7267 2953.7311 2960.5193 2969.2718 2970.9056 2976.1189 2985.6013 2989.8138 2989.9586 2998.8833 3002.0461 3016.7334 3031.5259 3032.1188 3033.3142 3037.4085 3040.7197 3060.5415 3061.3916 3069.4614 3071.2191 3078.3435 3136.5316 3140.4009 3141.5497 3148.2802 3160.7097 3161.8147 3175.6927 3182.0172 3188.6044 3196.4106 3198.1203
redmass: 3.8685 2.9602 2.0818 3.6685 3.1846 3.3083 1.8637 2.4377 1.7389 2.3159 1.2440 1.8397 3.1486 3.5572 2.6623 1.4411 2.3279 1.9902 3.5903 2.4627 1.5309 1.1490 3.5306 2.9225 3.0016 2.4950 2.9901 3.1946 1.1966 3.5989 3.0878 3.3302 2.5440 3.2152 2.9196 3.0071 3.1096 3.0946 3.3623 3.4820 4.8270 4.8255 4.6865 6.5101 7.7955 5.5056 1.0639 1.0961 4.5166 1.1685 5.5547 3.0811 1.4860 1.2930 1.8851 1.3598 1.4905 2.7755 2.9364 3.5510 1.3472 2.5617 3.6693 1.5431 3.2295 3.8903 1.2045 3.8566 1.4159 2.6076 2.2304 1.4616 1.2194 1.3283 1.3002 2.2530 2.4703 1.5614 1.3737 1.6965 1.6018 1.8516 1.7657 1.6940 1.6502 1.7562 2.7029 2.2516 1.2725 1.3718 1.0433 1.1485 1.1116 1.3768 1.3104 1.3581 1.5229 1.6553 3.3006 6.8377 1.2143 3.1230 1.1753 1.1394 1.1485 1.1781 1.0551 1.1708 1.1018 1.0761 1.0955 1.0551 1.0762 1.0479 1.1450 1.0417 1.0800 1.0778 1.3282 1.2258 1.0451 1.0843 1.0674 1.1522 1.1074 1.0741 7.4717 6.1299 8.6342 1.0601 1.0591 1.0601 1.0630 1.0630 1.0362 1.0373 1.0369 1.0945 1.0948 1.0644 1.1013 1.0570 1.0738 1.0342 1.0354 1.1023 1.1013 1.1019 1.1024 1.1007 1.0992 1.0989 1.1047 1.1053 1.1047 1.1061 1.0961 1.0897 1.1020 1.0923 1.1009 1.0949
irintensity: 0.8408 1.3661 1.1191 4.2970 1.0555 0.1497 2.1021 1.3548 0.1224 0.5790 0.0618 0.3322 1.0078 0.1297 1.4648 0.3625 0.8370 0.0857 2.0014 0.7059 0.3904 0.0174 1.4301 0.2542 3.5300 0.2692 1.6823 0.6095 0.3317 21.9838 0.8888 1.8012 2.0899 0.7270 4.4559 3.7165 0.1930 4.7836 12.8407 1.3300 5.0028 10.6432 2.4867 7.8027 10.3633 17.6917 12.1159 0.5600 16.0258 2.2364 16.4931 57.5334 34.4281 1.7095 2.1482 2.5287 17.4413 19.3145 5.7955 27.2907 0.1570 97.3290 3.1401 42.8031 0.7911 0.7307 0.2688 5.3761 27.5381 1.2669 1.0954 10.9765 0.4027 27.2634 1.0609 684.6834 48.3016 2.7749 0.0420 0.1222 41.7846 0.7382 47.9789 31.7158 46.4841 19.1844 5.9833 36.7844 3.4013 21.7591 1.4575 12.1504 0.7273 24.1215 19.4839 2.4086 0.2843 0.3986 138.6047 3.6229 11.5426 7.8188 3.7428 21.3475 29.1865 7.6984 1.5093 13.5562 15.4681 2.6019 10.7461 5.6661 9.5957 17.4705 33.8092 0.9237 1.9372 32.2033 88.9149 72.2218 41.5174 35.0400 25.9679 26.7882 15.1014 22.3898 14.8910 125.7877 447.8246 9.5011 2.4903 18.7594 9.7712 104.2673 37.9905 20.8451 90.8800 6.6365 3.1909 31.9812 1.0309 4.7361 15.1244 3.8183 23.0253 46.5561 88.4790 26.9557 19.7027 87.3714 45.0126 1.4090 0.4177 0.1887 18.7241 2.7179 3.9927 1.4545 1.0015 9.3417 0.4594 2.4650
temp: 298.150 k
press: 1.00000 atm
elementType: 8 8 7 7 6 6 6 6 6 6 6 6 6 6 6 6 6 6 6 6 6 6 6 1 1 1 1 1 1 1 1 1 1 1 1 1 1 1 1 1 1 1 1 1 1 1 1 1 1 1 1 1 1 1 1 1
symmnumber: 1
zpe: 1291506.8 jmol-1
zpe.correction: 0.491909 hartree
zpe.thermalcorrener: 0.519413 hartree
zpe.thermalcorrenthalpy: 0.520357 hartree
zpe.thermalcorrgfe: 0.430527 hartree
zpe.sumelectzpe: -1001.707855 hartree
zpe.sumelectthermal: -1001.680351 hartree
zpe.sumelectthermalent: -1001.679407 hartree
zpe.sumelectthermalfe: -1001.769237 hartree
dipole: 4.3396 11.7423 0.0001
dipole: 12.5185
quadrupole: -91.2070 -53.8439 -134.9413
quadrupole: -16.5941 -2.3635 -3.3044
quadrupole: 2.1237 39.4868 -41.6106 -16.5941 -2.3635 -3.3044
hfenergy: -1002.199764 hartree
pointgroup: C01 [X(C19H33N2O2)]
dipole: -1.7552224 4.6016132 0.0404914 debye
polarizability: 277.9625467|21.1319586|272.4926805|-4.4292021|11.1449701|156.6909879 unknown
InChI: InChI=1S/C19H33N2O2/c1-7-8-9-10-11-12-16-15-17(23-19(22)20(2)3)13-14-18(16)21(4,5)6/h13-15H,7-12H2,1-6H3
charge 1 multiplicity 1
56 atoms
O  -3.329537 -1.03999 -0.12206
O  -1.68011 -2.754392 -0.24954
N  -0.022744 3.671776 0.128749
N  -3.976221 -3.244016 -0.351981
C  -0.824705 2.356481 0.055441
C  -0.248404 1.150006 -0.448415
C  1.187244 0.88261 -0.915735
C  2.004405 0.018291 0.09139
C  3.426766 -0.291204 -0.425831
C  1.226394 3.497775 1.005865
C  0.351677 4.138997 -1.287334
C  -0.817094 4.821721 0.758523
C  4.235153 -1.188508 0.539071
C  -2.175835 2.384666 0.481432
C  -1.085877 0.00352 -0.505521
C  5.655328 -1.50904 0.020525
C  -2.426944 0.030498 -0.067418
C  -2.975938 1.233992 0.429533
C  6.460456 -2.417505 0.977935
C  7.876461 -2.736408 0.452773
C  -2.891036 -2.421311 -0.250362
C  -3.742018 -4.699696 -0.457249
C  -5.385672 -2.807456 -0.341888
H  1.135002 0.321947 -1.868518
H  1.770255 1.791646 -1.145702
H  2.06592 0.526692 1.076134
H  1.461874 -0.928644 0.273875
H  3.35597 -0.791214 -1.413996
H  3.982292 0.655944 -0.596281
H  1.867412 2.71145 0.597065
H  0.895694 3.214376 2.015836
H  1.773454 4.453412 1.034473
H  0.918375 5.080792 -1.214207
H  0.95652 3.374077 -1.786217
H  -0.579236 4.29417 -1.852114
H  -0.156141 5.701176 0.790874
H  -1.697879 5.051806 0.143146
H  -1.117488 4.550184 1.780259
H  3.683573 -2.136857 0.704205
H  4.309995 -0.695082 1.53081
H  -2.642191 3.291959 0.866443
H  -0.667644 -0.932236 -0.880263
H  5.582927 -2.000505 -0.972021
H  6.214165 -0.563194 -0.140562
H  -4.015813 1.25685 0.764914
H  6.534135 -1.928428 1.970801
H  5.902816 -3.362703 1.137591
H  8.428421 -3.388734 1.153166
H  7.831377 -3.253567 -0.524038
H  8.468816 -1.81209 0.315987
H  -4.21357 -5.221722 0.395346
H  -2.660818 -4.897714 -0.449579
H  -4.177817 -5.085951 -1.396546
H  -5.892437 -3.169295 -1.255391
H  -5.448954 -1.713633 -0.305445
H  -5.906052 -3.230919 0.537353
