program: Gaussian 09
title: 000047753
version: EM64L-G09RevD.01
frameworkgroup: C1[X(C21H13NO6S)]
method: RPBEPBE
basis: SDD
operation: Freq
keyword: #p
keyword: freq=noraman
keyword: PBEPBE/SDD
title: #p freq=noraman PBEPBE/SDD
converged: YES YES NO NO
title: Mulliken charges:
elementType: S O O O O O O N C C C C C C C C C C C C C C C C C C C C C H H H H H H H H H H H H H
charge: 0.981147 -0.170090 -0.275566 -0.559981 -0.192732 -0.476336 -0.515255 -0.660055 0.125597 0.124852 0.238097 0.392124 -0.362619 0.327558 0.272841 -0.223384 -0.141799 -0.372658 -0.005351 -0.385832 -0.371553 0.359104 -0.227850 -0.224791 -0.343720 -0.356418 -0.237894 -0.231396 -0.231582 0.307719 0.295617 0.296638 0.364999 0.390932 0.245293 0.244472 0.239912 0.275340 0.386965 0.230989 0.233527 0.233137
chargesum: 0.00000
title: Mulliken charges with hydrogens summed into heavy atoms:
elementType: S O O O O O O N C C C C C C C C C C C C C C C C C C C C C
charge: 0.981147 -0.170090 -0.275566 -0.173016 -0.192732 -0.476336 -0.515255 0.095877 0.125597 0.124852 0.238097 0.392124 -0.362619 0.327558 0.272841 -0.223384 -0.141799 -0.064939 -0.005351 -0.090215 -0.074915 0.359104 0.017443 0.019681 -0.103809 -0.081079 -0.006904 0.002131 0.001555
polarizability: 3.85097228e+02 -1.07607283e+01 3.66581909e+02 1.89724547e+00 -2.42570816e+01 1.88507201e+02
1716.lowfreq: -6.0178 -3.4436 0.0006 0.0016 0.0018 3.5649 10.0951 26.6559 35.7152
frequency: 9.9091 26.6492 35.7056 38.1739 43.8180 84.6868 94.6665 106.6462 114.9190 134.0378 142.3751 163.9997 172.3076 176.8283 198.4637 213.9404 226.6327 235.5286 267.3653 274.2709 290.5527 310.9996 328.4988 347.2830 365.6799 384.7284 395.6406 401.3464 411.2388 420.3200 421.8822 439.8556 453.0718 478.0380 481.1244 518.5905 525.5260 549.4259 591.7295 612.7880 623.1221 652.0435 655.5125 670.6400 676.4984 695.2095 716.9739 721.1795 741.0806 751.9493 780.0347 790.9448 803.9776 813.0056 821.0006 859.1123 860.7715 875.0765 881.1843 902.7949 929.6875 936.8448 945.0267 951.8572 970.7069 989.2653 991.6379 998.9958 1008.0423 1017.0888 1018.3814 1026.0314 1045.9171 1050.4495 1083.8088 1088.3593 1120.6894 1168.9342 1173.6268 1176.5160 1182.9487 1193.9875 1250.2245 1262.4108 1291.9467 1311.5065 1318.2340 1341.5821 1387.1711 1388.9263 1397.6327 1408.6888 1434.8057 1437.3728 1448.9143 1473.9783 1478.1033 1504.5625 1521.5901 1543.7470 1549.6921 1578.2542 1592.0639 1602.1015 1607.8799 1609.2096 1622.1914 3127.1038 3135.0767 3141.3720 3145.2650 3146.8566 3156.0002 3158.7425 3167.0102 3169.4512 3175.9823 3277.2586 3459.3638 3475.0462
redmass: 7.1576 7.5552 5.4094 4.6699 7.2153 6.8463 6.9907 8.0253 7.6352 6.5360 6.3210 5.6533 5.8643 2.5634 8.7827 5.5982 3.2804 5.6542 5.5140 4.7883 5.8012 8.5140 9.3918 6.6004 8.3634 7.6592 7.6684 2.8815 8.2660 3.5870 6.0549 5.8330 7.2599 6.2499 5.3902 6.4402 6.9741 9.5118 6.8099 6.4598 6.4976 6.1793 6.4918 6.0603 3.8984 2.0271 3.9819 4.2279 2.0983 1.3754 3.8637 3.2833 3.7616 2.0366 10.1817 1.2602 1.2475 2.5811 7.8884 6.9924 1.6243 1.9453 1.4904 8.0416 6.6139 5.5652 1.4224 1.3945 1.3370 1.3698 3.1597 2.1510 1.1892 1.9850 1.5850 2.5281 2.6794 1.6771 1.0686 1.3320 1.3472 1.9317 1.6771 2.8335 2.2625 2.4332 1.6392 4.1863 6.0489 9.3011 9.6368 9.7158 2.3733 2.9667 2.9245 2.7731 2.2687 8.6614 5.1553 10.4848 9.9798 3.0464 6.4284 2.1917 6.5071 6.0586 4.6687 1.0852 1.0883 1.0866 1.0924 1.0925 1.0905 1.0961 1.0949 1.1009 1.1001 1.0521 1.1031 1.0666
irintensity: 0.7534 0.4233 0.2290 0.6508 1.2824 1.9211 1.5636 0.7674 0.7860 0.2398 2.6498 1.3987 4.6042 34.9375 1.9389 3.2802 19.0752 2.6578 2.0684 17.1476 59.7074 1.2701 9.7364 21.7530 11.4365 14.0258 1.3941 1.8344 78.5404 0.9347 12.1066 4.7984 6.1193 12.5680 9.7582 15.6876 34.0878 137.7776 9.9473 0.2662 40.3460 37.4358 24.1492 10.1652 8.5617 35.1416 41.2663 9.7251 55.6597 19.8470 15.4907 10.7733 41.7391 48.9836 69.4122 143.5781 1.5354 38.9018 31.3506 47.1492 8.9661 0.2145 1.2982 35.8936 84.9018 3.8700 0.4858 3.7649 0.3722 0.0754 28.9296 5.8910 94.1206 9.6598 11.3542 3.9242 2.4587 19.5458 4.9781 20.6762 28.8995 10.2459 25.3652 337.8741 294.2272 155.9898 69.9597 8.0082 100.0125 3.7484 92.9070 26.5652 16.6402 97.2265 23.3509 5.0920 6.9341 6.4463 101.6036 176.5328 180.3719 5.7859 9.7053 60.2353 2.7729 12.1466 243.7657 1.9858 4.0158 3.3011 7.9926 23.0596 6.6309 14.7082 1.3073 26.5316 27.0948 73.3898 282.6505 38.4495
temp: 298.150 k
press: 1.00000 atm
elementType: 16 8 8 8 8 8 8 7 6 6 6 6 6 6 6 6 6 6 6 6 6 6 6 6 6 6 6 6 6 1 1 1 1 1 1 1 1 1 1 1 1 1
symmnumber: 1
zpe: 765295.9 jmol-1
zpe.correction: 0.291486 hartree
zpe.thermalcorrener: 0.316259 hartree
zpe.thermalcorrenthalpy: 0.317203 hartree
zpe.thermalcorrgfe: 0.234990 hartree
zpe.sumelectzpe: -1710.055478 hartree
zpe.sumelectthermal: -1710.030704 hartree
zpe.sumelectthermalent: -1710.029760 hartree
zpe.sumelectthermalfe: -1710.111973 hartree
dipole: 4.2659 -1.7177 4.8333
dipole: 6.6715
quadrupole: -162.0721 -160.9302 -179.3059
quadrupole: -6.5891 -7.8741 9.6941
quadrupole: 5.3640 6.5058 -11.8698 -6.5891 -7.8741 9.6941
hfenergy: -1710.3469637 hartree
pointgroup: C01 [X(C21H13N1O6S1)]
dipole: -1.2937366 -1.205394 1.9397672 debye
polarizability: 377.3569238|13.959171|373.2980874|-27.0738686|7.2523747|189.5313263 unknown
InChI: InChI=1S/C21H13NO6S/c22-18-15(29(26,27)28)10-14(19(23)11-6-2-1-3-7-11)16-17(18)21(25)13-9-5-4-8-12(13)20(16)24/h1-10,26H,22H2
charge 0 multiplicity 1
42 atoms
S  1.767011 4.174312 -0.103349
O  -0.311644 -2.273326 -1.002214
O  -3.337275 1.996847 0.698709
O  2.206669 3.960418 1.689042
O  2.267132 -0.95111 -2.400387
O  3.118401 4.138705 -0.983239
O  0.759821 5.449119 -0.215736
N  -1.291801 3.595787 0.443556
C  -0.374757 0.053523 -0.396981
C  -1.167908 1.178415 -0.002653
C  1.001639 0.183337 -0.711814
C  -0.566269 2.501437 0.087746
C  0.82939 2.565338 -0.248994
C  -2.430033 -1.470405 -0.190369
C  -3.200561 -0.351546 0.232547
C  -0.999811 -1.303302 -0.55061
C  -2.598911 1.008746 0.325186
C  1.591496 1.469028 -0.645913
C  1.902428 -0.952155 -1.187555
C  -3.029305 -2.751528 -0.277959
C  -4.56664 -0.526605 0.563666
C  2.472349 -1.904292 -0.184462
C  -4.387232 -2.918649 0.056754
C  -5.156615 -1.803598 0.478266
C  2.279814 -1.731475 1.211253
C  3.257455 -2.991235 -0.653416
C  2.862369 -2.63523 2.125315
C  3.834892 -3.894182 0.259584
C  3.63855 -3.718712 1.651947
H  2.645321 1.607787 -0.912028
H  -2.413113 -3.592474 -0.610513
H  -5.13938 0.349493 0.881634
H  -0.866667 4.530751 0.40103
H  -2.286562 3.427692 0.668685
H  -4.850158 -3.908628 -0.009661
H  -6.21268 -1.935484 0.736061
H  1.68759 -0.887995 1.583922
H  3.395381 -3.104228 -1.733703
H  2.757477 4.750267 1.966018
H  2.716104 -2.495237 3.201877
H  4.436035 -4.733708 -0.106199
H  4.090098 -4.420596 2.362156
