program: Gaussian 09
title: 000047666
version: EM64L-G09RevD.01
frameworkgroup: C1[X(C16H14N4O2)]
method: RPBEPBE
basis: SDD
operation: Freq
keyword: #p
keyword: freq=noraman
keyword: PBEPBE/SDD
title: #p freq=noraman PBEPBE/SDD
converged: YES YES NO NO
title: Mulliken charges:
elementType: O O N N N N C C C C C C C C C C C C C C C C H H H H H H H H H H H H H H
charge: -0.444594 -0.256720 -0.054293 -0.023143 -0.158085 -0.013670 -0.540297 0.501182 -0.354336 -0.417437 -0.617556 -0.362264 -0.360417 0.396351 0.182872 0.255269 -0.348496 -0.296885 -0.338905 -0.313200 0.108125 -0.250728 0.231541 0.264714 0.259517 0.241578 0.260061 0.225726 0.263317 0.261790 0.260529 0.250183 0.262591 0.271379 0.272037 0.382265
chargesum: 0.00000
title: Mulliken charges with hydrogens summed into heavy atoms:
elementType: O O N N N N C C C C C C C C C C C C C C C C
charge: -0.062329 -0.256720 -0.054293 -0.023143 -0.158085 -0.013670 -0.044042 0.501182 -0.094819 -0.175859 0.131549 -0.100474 -0.099888 0.396351 0.182872 0.255269 -0.098313 -0.034294 -0.067526 -0.041163 0.108125 -0.250728
polarizability: 4.30249207e+02 -2.77541929e+01 1.71246848e+02 -3.22325276e+00 2.07344495e+00 1.48543635e+02
1716.lowfreq: -1.1471 -0.0005 -0.0001 0.0005 3.0994 4.8783 10.6757 20.0850 26.3669
frequency: 10.5474 20.0289 26.3416 51.4396 62.0701 69.3457 77.7430 106.9864 121.5222 132.0338 160.6397 182.0715 211.7422 228.4487 256.7624 270.1602 332.0342 350.3058 371.7509 388.1965 402.4425 413.0400 420.2779 455.6386 476.9594 515.8058 520.9659 545.9861 556.6770 573.8365 588.9451 624.6711 632.1475 645.1845 689.3067 695.9760 733.3738 751.8108 769.3303 805.3355 829.4684 853.3805 856.5047 859.0803 878.7487 895.1454 957.8262 982.3002 991.4803 994.4703 995.4300 1000.9584 1013.3616 1015.3051 1046.8082 1096.5451 1112.3076 1121.2157 1146.7544 1163.7555 1169.2544 1187.7697 1203.3330 1205.2336 1216.1357 1285.4921 1300.1375 1309.9850 1319.6887 1326.7924 1336.9203 1344.0861 1380.2800 1383.6381 1412.6784 1427.1209 1433.6293 1438.6696 1453.4449 1480.7727 1488.7941 1499.9220 1567.0452 1570.8547 1613.9058 1619.4639 1638.3323 2180.0444 2988.5141 2992.2726 3058.6437 3071.3462 3122.4690 3129.3184 3139.6773 3151.2907 3159.1158 3163.8360 3167.8018 3171.3254 3180.0675 3532.2485
redmass: 7.6097 5.3465 3.9635 6.5555 4.1016 5.7170 6.1231 1.6411 2.2510 7.4914 6.3700 5.7363 5.1803 5.4082 5.4544 5.0019 5.2981 4.8698 2.4584 6.0901 2.8637 3.0310 5.0206 6.0386 7.2414 3.0018 4.8726 7.4553 4.4380 4.1313 1.2434 5.2136 6.4489 5.8514 3.6231 4.0720 4.6745 4.3846 4.5766 4.1996 4.2941 1.6864 1.2458 1.2827 1.7186 5.0714 1.7104 1.5141 1.4255 1.3819 3.9637 1.3568 2.9886 2.7996 1.9698 1.3171 1.3001 1.4117 1.6443 1.7010 1.5975 1.7628 1.9611 2.1119 2.7041 1.9406 1.5177 1.7254 2.5457 2.5118 2.3898 2.9542 4.3145 2.9820 2.8071 4.1445 1.2971 1.0529 1.1015 1.2235 2.1260 2.4312 7.6074 6.6480 6.3341 6.1624 8.4865 12.6313 1.0516 1.0437 1.0989 1.1000 1.1016 1.0896 1.0891 1.0880 1.0877 1.0958 1.0973 1.0970 1.0969 1.0641
irintensity: 0.8534 0.9912 0.4291 0.2485 1.7707 0.9969 0.5468 1.1424 2.8775 5.2969 1.6103 0.1370 0.3519 4.5248 2.5655 0.4216 5.2947 7.0283 1.3514 1.5331 0.6964 1.7691 3.8200 16.6999 17.4943 37.9898 47.0004 1.7215 3.0901 35.5829 73.1001 5.4265 6.4345 9.1791 76.6083 6.9187 3.1564 2.2417 9.3092 13.3760 13.3538 40.8695 0.0226 5.0656 60.7256 23.9669 23.6055 3.4473 0.3945 5.3149 159.9698 0.1422 21.4372 222.2603 126.4128 2.4607 11.3625 19.2699 240.4983 62.2191 17.6352 1.0430 1.5153 5.9969 2.1716 124.4083 13.3542 45.6892 178.3545 179.4878 366.0258 120.9237 9.2880 4.2484 11.1799 14.7504 57.7245 27.4740 10.8365 101.0909 9.7500 19.2376 48.5917 0.7995 143.0735 12.6141 431.2406 38.7285 24.0800 54.5702 5.7856 15.6924 13.6900 9.2424 5.2596 1.5629 1.0312 9.6278 0.4001 7.6522 1.3167 56.7210
temp: 298.150 k
press: 1.00000 atm
elementType: 8 8 7 7 7 7 6 6 6 6 6 6 6 6 6 6 6 6 6 6 6 6 1 1 1 1 1 1 1 1 1 1 1 1 1 1
symmnumber: 1
zpe: 711060.8 jmol-1
zpe.correction: 0.270829 hartree
zpe.thermalcorrener: 0.290894 hartree
zpe.thermalcorrenthalpy: 0.291838 hartree
zpe.thermalcorrgfe: 0.218097 hartree
zpe.sumelectzpe: -985.961412 hartree
zpe.sumelectthermal: -985.941347 hartree
zpe.sumelectthermalent: -985.940403 hartree
zpe.sumelectthermalfe: -986.014144 hartree
dipole: -1.7581 3.6062 2.6797
dipole: 4.8245
quadrupole: -175.2220 -124.7616 -125.1779
quadrupole: -30.2984 -2.1566 -3.8736
quadrupole: -33.5015 16.9589 16.5426 -30.2984 -2.1566 -3.8736
hfenergy: -986.2322408 hartree
pointgroup: C01 [X(C16H14N4O2)]
dipole: -0.7270317 -1.2149073 -1.2642272 debye
polarizability: 429.7761502|30.0503401|170.4624479|-2.8383568|4.8749797|149.8010915 unknown
InChI: InChI=1S/C16H14N4O2/c1-20(11-13-4-2-12(10-17)3-5-13)19-18-15-8-6-14(7-9-15)16(21)22/h2-9,21H,11H2,1H3
charge 0 multiplicity 1
36 atoms
O  6.419407 1.889769 -0.987158
O  7.215928 0.632273 0.795487
N  -1.037524 -1.746809 -0.347526
N  0.153162 -1.109643 -0.508842
N  1.075974 -1.512336 0.34453
N  -7.385414 2.080895 1.833941
C  -2.107901 -1.330937 -1.265565
C  -3.257801 -0.603545 -0.570412
C  -2.995499 0.461771 0.329595
C  -4.601651 -0.963483 -0.836047
C  -1.250678 -2.775158 0.686039
C  -4.051132 1.15473 0.949742
C  -5.669014 -0.275897 -0.224147
C  -5.399766 0.790356 0.675874
C  2.329646 -0.847701 0.178833
C  4.907268 0.332988 0.052685
C  3.346035 -1.238159 1.094404
C  2.617994 0.14279 -0.807429
C  4.621639 -0.654393 1.033017
C  3.893831 0.724064 -0.865627
C  6.265779 0.922698 0.025588
C  -6.484478 1.495388 1.308584
H  -2.497857 -2.21432 -1.807237
H  -1.624963 -0.668742 -2.006673
H  -1.958742 0.745181 0.543054
H  -4.817762 -1.787129 -1.526963
H  -0.570733 -3.63048 0.521664
H  -2.30019 -3.104822 0.640599
H  -1.027258 -2.368106 1.688212
H  -3.845347 1.977008 1.642055
H  -6.705553 -0.558215 -0.43282
H  3.104505 -2.000554 1.841624
H  1.835685 0.438592 -1.51208
H  5.412358 -0.945262 1.731966
H  4.126577 1.484338 -1.616629
H  7.349375 2.239648 -0.945734
