program: Gaussian 09
title: 000046478
version: EM64L-G09RevD.01
frameworkgroup: C1[X(C15H22N2O2)]
method: RPBEPBE
basis: SDD
operation: Freq
keyword: #p
keyword: freq=noraman
keyword: PBEPBE/SDD
title: #p freq=noraman PBEPBE/SDD
converged: NO YES NO NO
title: Mulliken charges:
elementType: O O N N C C C C C C C C C C C C C C C H H H H H H H H H H H H H H H H H H H H H H
charge: -0.284700 -0.244957 -0.095086 -0.003047 -0.068165 -0.403497 -0.366857 -0.415284 -0.390923 -0.342023 -0.738390 -0.404836 -0.262491 0.202495 0.213904 -0.265652 -0.412795 -0.180145 -0.318534 0.211831 0.188797 0.208084 0.201904 0.179811 0.196514 0.212965 0.203634 0.191953 0.173349 0.205590 0.219333 0.226825 0.220368 0.228474 0.212182 0.227609 0.227668 0.280345 0.281245 0.235857 0.246644
chargesum: 0.00000
title: Mulliken charges with hydrogens summed into heavy atoms:
elementType: O O N N C C C C C C C C C C C C C C C
charge: -0.284700 -0.244957 -0.095086 -0.003047 0.143666 -0.006617 0.014859 -0.005806 0.004665 0.036915 -0.071862 0.035821 0.192786 0.202495 0.213904 0.014693 -0.131550 0.055712 -0.071890
polarizability: 2.43506849e+02 -1.00673965e+01 1.80820492e+02 3.02150158e+00 6.09743508e+00 1.18198569e+02
1716.lowfreq: -19.0781 -6.7931 -0.0009 -0.0007 -0.0005 7.2321 8.3970 24.3144 29.2905
frequency: -11.9085 23.5374 29.0244 48.3708 69.8608 73.2961 99.3766 134.8721 144.0342 154.8949 170.9560 195.3820 202.9639 225.5184 277.0017 316.4333 319.2101 355.2167 374.5880 375.2927 400.6198 432.4173 435.1979 489.6552 494.5661 521.7018 610.0569 612.0009 685.2678 697.4409 720.1392 726.7953 759.5572 801.8708 807.8720 821.5361 829.8932 850.4376 866.0331 885.0608 907.7286 923.8840 944.1104 968.4565 975.6124 993.4911 997.6321 1002.1512 1023.1917 1028.1135 1041.2186 1062.4668 1070.7218 1081.3342 1087.8330 1109.1997 1118.6576 1122.6984 1150.1055 1153.9083 1177.8188 1183.2078 1199.5532 1238.2032 1240.9389 1259.4238 1264.8318 1275.8969 1284.0663 1295.1630 1307.1770 1311.8806 1325.5108 1336.7667 1339.0132 1344.9088 1353.3328 1364.8555 1371.5187 1375.0710 1385.7139 1411.9876 1447.6299 1453.5176 1457.1477 1463.9225 1467.9380 1470.2359 1472.4200 1484.2090 1486.7597 1490.4102 1551.2813 1582.7591 1621.9665 2839.2639 2848.6260 2967.6290 2977.5086 2980.4853 2984.6482 2990.0301 2996.7459 3002.6539 3011.6001 3029.4724 3033.7769 3042.7784 3052.5651 3053.6178 3070.9821 3081.5881 3083.8215 3135.1087 3151.6296 3160.5492 3182.3399
redmass: 3.6400 4.8174 4.7085 3.6301 2.8151 4.3670 3.0978 3.2057 2.9442 3.6403 1.7718 1.6537 3.7638 2.5217 4.1523 2.6475 2.0237 2.7754 3.0110 3.2247 2.9546 4.7655 3.3191 3.1300 3.4086 3.1481 5.0374 2.4044 7.0698 7.1602 1.8099 3.4717 1.0950 3.5357 2.3231 2.0706 1.7211 1.9431 1.4765 1.4762 5.3088 2.2987 1.3640 1.5146 1.6735 1.6880 4.0170 1.3855 4.3214 2.1327 2.5835 2.3829 2.4898 1.9382 2.7818 2.0871 1.6268 1.5053 2.1388 2.4000 1.2071 1.5657 1.3024 1.7940 2.6920 1.2239 1.2120 1.2547 1.1949 1.3360 1.4981 10.5848 1.2551 1.3891 1.3464 1.3970 1.4404 1.4147 1.3984 1.2835 1.4003 2.1877 1.0880 2.1535 1.0866 1.0773 1.0740 1.0684 1.0825 1.0837 1.0745 1.0800 5.9450 5.9032 11.4267 1.0714 1.0700 1.0791 1.0587 1.0387 1.0617 1.0661 1.0576 1.0843 1.0626 1.0899 1.0934 1.1031 1.1049 1.1034 1.0993 1.0992 1.1057 1.0887 1.0926 1.0933 1.0985
irintensity: 0.6896 2.5609 0.4740 0.0544 0.2231 0.3952 0.9386 0.4895 0.5327 0.8191 0.4919 0.4262 3.9712 1.0302 3.6701 5.7655 0.5672 4.3551 0.4210 0.5908 11.7436 2.7282 8.1247 7.5773 4.4618 2.8008 2.9448 0.9831 1.7395 5.9217 59.0418 8.4242 3.0362 5.1787 1.1087 3.1724 21.0649 3.9295 5.1959 3.0076 12.3392 1.8218 1.3215 2.9511 9.7218 19.0090 113.9485 0.2891 8.2274 2.1361 9.3708 217.6303 62.2077 16.8602 9.9316 20.5522 40.3463 2.4722 39.2049 17.2706 2.8323 0.2948 4.3262 40.7226 323.6799 14.8981 6.9795 3.9751 6.4619 8.0814 9.4309 7.1160 3.8594 2.7009 18.4463 1.2414 3.4895 5.9030 12.7588 22.3496 9.1873 17.6441 5.4749 7.3453 12.1999 6.1478 5.1572 8.0958 1.6135 7.2928 10.7470 2.7232 17.8596 35.2744 191.1001 32.3162 145.8264 13.7209 22.7342 36.7317 47.9953 47.6583 11.6227 17.1803 29.0691 71.8443 40.7819 19.3167 1.8303 90.6284 43.7660 29.8457 67.3648 10.4474 3.5303 16.7524 8.2227
temp: 298.150 k
press: 1.00000 atm
elementType: 8 8 7 7 6 6 6 6 6 6 6 6 6 6 6 6 6 6 6 1 1 1 1 1 1 1 1 1 1 1 1 1 1 1 1 1 1 1 1 1 1
symmnumber: 1
zpe: 912600.7 jmol-1
zpe.correction: 0.347591 hartree
zpe.thermalcorrener: 0.365664 hartree
zpe.thermalcorrenthalpy: 0.366608 hartree
zpe.thermalcorrgfe: 0.299633 hartree
zpe.sumelectzpe: -843.273894 hartree
zpe.sumelectthermal: -843.255821 hartree
zpe.sumelectthermalent: -843.254877 hartree
zpe.sumelectthermalfe: -843.321852 hartree
dipole: 3.8346 2.6008 0.3166
dipole: 4.6442
quadrupole: -127.4365 -113.3782 -114.9507
quadrupole: -17.8028 -3.9908 -1.3007
quadrupole: -8.8481 5.2103 3.6378 -17.8028 -3.9908 -1.3007
hfenergy: -843.6214848 hartree
pointgroup: C01 [X(C15H22N2O2)]
dipole: -1.5108208 1.0130425 -0.1723962 debye
polarizability: 243.5522104|10.0942625|179.7278885|0.6969753|-10.3378535|119.2458112 unknown
InChI: InChI=1S/C15H22N2O2/c1-13-6-2-3-9-17(13)10-5-11-19-15(18)14-7-4-8-16-12-14/h4,7-8,12-13H,2-3,5-6,9-11H2,1H3
charge 0 multiplicity 1
41 atoms
O  1.484293 -0.341479 -0.036821
O  2.729948 -2.242168 0.492846
N  -3.441813 0.011497 -0.108004
N  6.312487 0.032096 0.028844
C  -4.678469 -0.652983 -0.627884
C  -5.714762 0.438191 -1.006388
C  -3.686887 0.897278 1.057377
C  -6.016776 1.393319 0.171841
C  -4.702096 2.004109 0.706337
C  -2.29569 -0.906932 0.078018
C  -5.28279 -1.731415 0.319826
C  -0.937536 -0.18697 -0.101929
C  0.233686 -1.141541 0.128692
C  2.681898 -1.027319 0.179036
C  3.867138 -0.141007 -0.009425
C  3.754436 1.226607 -0.366991
C  5.164652 -0.688541 0.176268
C  4.934183 1.983718 -0.522593
C  6.182497 1.349914 -0.316219
H  -4.377673 -1.16682 -1.564008
H  -6.643554 -0.047985 -1.362653
H  -5.301707 1.027634 -1.847868
H  -2.727716 1.360253 1.352738
H  -4.05306 0.325367 1.949335
H  -6.531651 0.845765 0.986699
H  -6.708092 2.192251 -0.1572
H  -4.258455 2.657894 -0.069573
H  -4.894235 2.626122 1.601999
H  -2.314969 -1.413787 1.077501
H  -2.376346 -1.708832 -0.682563
H  -6.142188 -2.227372 -0.168194
H  -4.53809 -2.512014 0.560835
H  -5.63971 -1.298229 1.270816
H  -0.890206 0.236221 -1.121019
H  -0.852614 0.65737 0.60678
H  0.255115 -1.972976 -0.600595
H  0.231191 -1.57728 1.145443
H  2.765235 1.667825 -0.515584
H  5.273759 -1.742683 0.452558
H  4.894165 3.041964 -0.79805
H  7.120498 1.905738 -0.428128
