program: Gaussian 09
title: 000007070
version: EM64L-G09RevD.01
frameworkgroup: C1[X(C12H10Cl2N2)]
method: RPBEPBE
basis: SDD
operation: Freq
keyword: #p
keyword: freq=noraman
keyword: PBEPBE/SDD
title: #p freq=noraman PBEPBE/SDD
converged: NO NO NO NO
title: Mulliken charges:
elementType: Cl Cl N N C C C C C C C C C C C C H H H H H H H H H H
charge: -0.085655 -0.085658 -0.682686 -0.682683 0.381834 0.381836 -0.393292 -0.393293 -0.396067 -0.396071 0.586426 0.586418 -0.341205 -0.341198 -0.405908 -0.405907 0.256844 0.256846 0.232647 0.232647 0.219507 0.219506 0.318575 0.308980 0.308981 0.318575
chargesum: 0.00000
title: Mulliken charges with hydrogens summed into heavy atoms:
elementType: Cl Cl N N C C C C C C C C C C C C
charge: -0.085655 -0.085658 -0.055131 -0.055127 0.381834 0.381836 -0.136448 -0.136447 -0.163420 -0.163424 0.586426 0.586418 -0.341205 -0.341198 -0.186401 -0.186401
polarizability: 3.11216711e+02 1.47400735e-04 1.70810835e+02 -8.70565163e+00 -1.33407915e-04 7.13557783e+01
1716.lowfreq: -4.4525 -0.0008 -0.0005 0.0011 3.7299 5.7386 35.4127 56.3612 69.5413
frequency: 35.4061 56.3510 69.5413 136.6499 151.3469 190.8009 206.3602 225.7845 268.5435 275.7093 298.4353 351.5909 369.2783 372.6250 390.0852 419.4344 427.1792 427.6840 452.0469 453.2782 462.8128 490.4020 547.2639 567.6862 607.6752 660.7626 680.1913 716.1187 722.5060 729.2425 808.4362 815.0803 829.1624 860.6498 871.9976 885.2131 936.2140 940.0349 1000.7571 1016.0476 1036.0345 1039.8998 1050.1496 1160.4397 1167.2610 1261.7418 1267.5731 1295.9889 1325.8213 1338.1204 1350.2027 1370.1690 1426.9513 1427.7160 1498.4263 1533.8250 1542.8630 1558.3455 1616.3725 1618.0493 1643.1891 1645.9090 3120.0477 3121.6328 3146.1845 3150.1002 3153.9010 3157.6258 3554.3007 3555.1367 3701.5914 3701.6177
redmass: 7.8171 5.2155 8.8219 4.9535 5.0944 5.7271 10.9250 5.7435 4.8710 6.5951 5.0326 3.9346 1.3844 1.1828 4.5803 5.9444 2.6887 2.6243 1.2015 1.1883 3.4531 3.4291 6.7729 4.1874 3.3489 6.9200 7.8037 3.6547 3.5265 6.0978 1.5047 1.5573 5.5523 6.0121 1.3939 1.5306 1.3544 1.3821 3.2551 2.1502 1.8333 1.8957 2.2638 1.1739 1.2685 1.5797 1.4247 1.5647 2.0618 3.6266 4.2291 6.4648 6.3824 4.4109 3.3646 3.6233 6.2098 7.4400 1.7130 1.4823 2.5090 3.1625 1.0872 1.0876 1.0958 1.0944 1.0925 1.0918 1.0452 1.0455 1.1036 1.1036
irintensity: 0.0633 3.8267 0.4920 0.0544 0.5009 0.7826 2.9470 0.7426 5.9736 4.1352 16.3964 15.6500 10.2366 303.7086 2.5243 3.2204 61.0377 4.5076 13.2890 205.5147 0.5246 3.5195 22.8000 8.2128 0.4999 4.1629 33.9943 2.5217 0.2322 37.3601 101.1204 9.0491 2.2855 17.1149 23.5980 1.5218 1.4216 0.1931 16.1136 3.3946 7.2496 65.2287 26.8479 31.4463 11.8769 18.7651 1.2036 7.7062 83.2173 28.2861 0.1602 3.3709 2.7292 4.7697 516.9026 0.0764 14.5301 3.6494 0.0018 85.0573 8.9276 579.8687 37.7719 5.5936 4.6222 27.3398 2.8132 0.2712 253.0464 4.2612 18.3885 50.3088
temp: 298.150 k
press: 1.00000 atm
elementType: 17 17 7 7 6 6 6 6 6 6 6 6 6 6 6 6 1 1 1 1 1 1 1 1 1 1
symmnumber: 1
zpe: 504008.1 jmol-1
zpe.correction: 0.191967 hartree
zpe.thermalcorrener: 0.206695 hartree
zpe.thermalcorrenthalpy: 0.207639 hartree
zpe.thermalcorrgfe: 0.149722 hartree
zpe.sumelectzpe: -1491.800349 hartree
zpe.sumelectthermal: -1491.785621 hartree
zpe.sumelectthermalent: -1491.784677 hartree
zpe.sumelectthermalfe: -1491.842594 hartree
dipole: 0.0000 -3.6020 0.0002
dipole: 3.6020
quadrupole: -71.2392 -99.8790 -113.5714
quadrupole: -0.0005 -7.1331 -0.0003
quadrupole: 23.6573 -4.9825 -18.6749 -0.0005 -7.1331 -0.0003
hfenergy: -1491.9923157 hartree
pointgroup: C01 [X(C12H10Cl2N2)]
dipole: -0.0000063 -1.4171347 0.0001044 debye
dipolederiv: -0.4040963 0.2640539 -0.0652931 0.4060889 -0.5781137 0.1334166 -0.0946342 0.1328495 -0.1122861 -0.4041054 -0.2640569 -0.0652944 -0.4060918 -0.5781117 -0.133412 -0.0946317 -0.1328457 -0.1122867 -1.9699301 -0.052062 0.0481802 -0.010233 -0.1551512 -0.1420888 0.0551859 -0.1406243 -0.672304 -1.969922 0.0520638 0.0482314 0.0102072 -0.1551328 0.1420557 0.0553785 0.1405803 -0.6723315 0.2441845 0.0188075 -0.0088249 -0.0335833 -0.188992 0.0123282 0.0049297 0.0401411 -0.0386074 0.2441948 -0.018816 -0.0088195 0.0335786 -0.1889902 -0.0123245 0.0049339 -0.0401383 -0.0386058 0.0290374 -0.0952074 0.0169791 0.1373818 -0.0888601 -0.0197494 -0.0967147 0.0074535 -0.0779537 0.0290342 0.0952105 0.0169728 -0.1373862 -0.0888602 0.0197439 -0.0967151 -0.0074608 -0.0779579 0.079533 0.1732236 -0.0484457 -0.0256691 0.1054874 -0.0841538 0.0527428 -0.0816285 -0.11069 0.0795232 -0.1732222 -0.0484455 0.0256718 0.1054895 0.0841511 0.0527372 0.0816296 -0.1106925 1.7883892 0.1966812 -0.1063803 0.1335447 -0.2245674 0.1060171 -0.1058885 0.0918119 0.1148521 1.7883839 -0.196687 -0.1064246 -0.1335552 -0.224576 -0.1060068 -0.1059497 -0.0917969 0.1148607 -0.0448444 -0.2846599 0.0745914 -1.0196615 0.7888476 -0.2317265 0.304891 -0.2515855 -0.0576693 -0.0448328 0.2846643 0.0746021 1.01968 0.7888472 0.2317178 0.304867 0.2515766 -0.0576713 -0.3665699 -0.1972931 0.0552263 0.4453181 0.0796141 -0.0977373 -0.1487857 -0.081805 -0.1860621 -0.3665679 0.197298 0.0552272 -0.445316 0.0796209 0.097737 -0.1487648 0.0818005 -0.186066 0.0939244 -0.0691174 0.0250024 -0.0820389 0.0146273 0.0457698 0.0269412 0.0406468 0.1319113 0.0939271 0.0691172 0.0250003 0.0820376 0.0146253 -0.045767 0.02694 -0.0406416 0.1319146 0.0618429 0.1044649 -0.0289434 0.0973658 -0.0241278 0.054203 -0.033934 0.04645 0.1261671 0.0618421 -0.1044626 -0.0289408 -0.0973657 -0.0241283 -0.0542003 -0.0339336 -0.0464478 0.1261697 -0.0397101 -0.0892675 0.0331814 -0.0913106 -0.0539774 0.0660868 0.0285744 0.0678644 0.1481114 -0.0397075 0.0892656 0.0331791 0.0913106 -0.0539838 -0.0660843 0.0285767 -0.0678622 0.1481132 0.2726008 0.0009403 0.0032258 -0.0539047 0.190681 0.0487698 0.0215706 0.0478186 0.3658256 0.2556352 0.0189666 0.0015 0.0680777 0.1345316 0.06416 -0.0148804 0.0638529 0.3687062 0.2556344 -0.0189661 0.0014947 -0.0680622 0.134519 -0.064139 -0.0149568 -0.0638174 0.3687261 0.2725993 -0.0009393 0.003218 0.0539157 0.1906818 -0.0487673 0.0215201 -0.0478216 0.3658264 unknown
polarizability: 311.5119833|-0.0004047|170.810835|-2.2083469|-0.0008162|71.0605056 unknown
InChI: InChI=1S/C12H10Cl2N2/c13-9-5-7(1-3-11(9)15)8-2-4-12(16)10(14)6-8/h1-6H,15-16H2
charge 0 multiplicity 1
26 atoms
Cl -3.82041 2.352521 -0.593968
Cl 3.820437 2.352494 0.593979
N  -5.029287 -0.333376 0.19112
N  5.029287 -0.333409 -0.191122
C  -0.743053 -0.339762 0.029786
C  0.743052 -0.339768 -0.029731
C  -1.493519 0.834041 -0.259784
C  1.493528 0.834031 0.259816
C  -1.477368 -1.510621 0.374134
C  1.477352 -1.510641 -0.374061
C  -3.642176 -0.34477 0.141027
C  3.642179 -0.344797 -0.140991
C  -2.891717 0.817435 -0.198952
C  2.891725 0.817412 0.198975
C  -2.880852 -1.517302 0.427995
C  2.880841 -1.517332 -0.427933
H  -0.986278 1.754443 -0.566108
H  0.986295 1.754442 0.566116
H  -0.935958 -2.426045 0.637155
H  0.935947 -2.426072 -0.637068
H  -3.414174 -2.433724 0.708748
H  3.41415 -2.433767 -0.708676
H  -5.538661 0.522564 -0.014879
H  -5.546392 -1.172926 0.432445
H  5.546389 -1.172994 -0.432321
H  5.538665 0.522523 0.014898
