program: Gaussian 09
title: 000047685
version: EM64L-G09RevD.01
frameworkgroup: C1[X(C6H6Cl4F8N3O2P3)]
method: RPBEPBE
basis: SDD
operation: Freq
keyword: #p
keyword: freq=noraman
keyword: PBEPBE/SDD
title: #p freq=noraman PBEPBE/SDD
converged: YES YES NO NO
title: Mulliken charges:
elementType: Cl Cl Cl Cl P P P F F F F F F F F O O N N N C C C C C C H H H H H H
charge: -0.041430 -0.070555 -0.041890 -0.086426 1.285011 0.685571 0.713543 -0.173181 -0.157245 -0.200792 -0.151776 -0.158038 -0.184158 -0.154181 -0.178223 -0.437772 -0.495579 -0.728102 -0.635840 -0.607785 -0.358983 -0.324554 0.361424 0.353058 0.076496 0.080785 0.295051 0.282203 0.291210 0.276070 0.244323 0.241765
chargesum: 0.00000
title: Mulliken charges with hydrogens summed into heavy atoms:
elementType: Cl Cl Cl Cl P P P F F F F F F F F O O N N N C C C C C C
charge: -0.041430 -0.070555 -0.041890 -0.086426 1.285011 0.685571 0.713543 -0.173181 -0.157245 -0.200792 -0.151776 -0.158038 -0.184158 -0.154181 -0.178223 -0.437772 -0.495579 -0.728102 -0.635840 -0.607785 0.218271 0.242725 0.361424 0.353058 0.320819 0.322550
polarizability: 2.52335268e+02 -6.90767624e-02 2.21535929e+02 -1.13473348e+01 4.06718458e+00 2.20411836e+02
1716.lowfreq: -5.7007 -3.0827 -0.0008 -0.0007 0.0019 2.8321 5.2020 14.3389 16.2043
frequency: 4.7595 14.0789 16.0581 25.8573 29.8235 31.9377 35.4249 46.2044 51.8414 60.1192 61.9800 80.3519 99.6159 102.2758 115.0251 122.1634 127.7011 141.1522 146.4744 156.5880 170.7433 191.5617 196.1440 211.0988 214.6090 230.9694 234.5572 237.9260 248.7210 254.5588 263.7396 280.4983 314.2986 319.7972 340.3488 348.4176 366.7815 376.5675 395.6214 412.6361 422.4982 435.0181 454.4579 459.1767 481.5193 488.0820 515.2248 518.8968 533.7308 618.6180 635.8870 672.2415 682.7370 711.0657 749.0660 777.7531 779.6413 877.6868 888.4174 892.8103 956.4314 966.4216 969.3133 978.8834 983.0847 1008.0384 1019.7183 1031.6283 1056.8162 1061.1773 1140.5857 1142.5728 1169.5184 1171.5356 1260.2969 1263.2552 1298.8054 1300.5061 1335.6391 1338.8838 1369.1765 1377.9547 1437.6900 1440.5532 3006.8540 3057.6579 3083.4323 3090.5727 3107.1975 3133.1432
redmass: 12.9199 19.8120 16.2477 15.7617 13.0962 27.5004 11.5343 12.6505 11.6293 12.1667 14.1045 16.4570 12.8784 19.5107 17.8280 19.4344 16.3513 10.5533 15.3710 12.4146 12.8844 9.8722 15.5908 17.3281 15.6706 14.5304 15.0928 14.3419 23.7923 24.2307 16.0996 14.9143 9.2661 10.1425 4.7569 4.4387 9.5696 7.7309 6.3151 7.4213 7.5688 28.9195 13.9565 26.8583 10.6354 9.4756 9.2970 8.7142 11.9456 25.1410 18.8940 8.5426 7.6559 9.2026 12.6763 6.1525 5.9875 13.1854 3.2763 2.8776 9.9092 9.8261 12.1768 8.6042 8.5272 11.9927 6.8862 8.3105 2.8083 2.9376 3.3757 3.4945 4.3329 4.5152 1.2608 1.2903 1.1835 1.1780 1.3845 1.3677 1.3002 1.2874 1.0872 1.0807 1.0629 1.0581 1.0882 1.0883 1.1015 1.1071
irintensity: 0.2548 0.2763 0.5918 1.2651 1.7220 0.2782 0.9000 1.1062 0.4550 2.6990 3.1656 1.0846 1.9218 0.4001 0.0181 0.2485 1.0894 4.3671 0.0674 3.2612 9.0455 4.0403 1.2385 1.1525 4.4331 1.7694 2.1119 4.0073 0.5914 0.9659 1.6887 3.3411 9.7966 40.8221 0.1794 2.5770 8.9033 13.5662 72.6538 69.4964 102.5639 9.1990 13.9228 201.7715 14.4879 29.9720 15.1489 7.6226 45.5363 18.2247 6.5078 18.9625 99.0843 58.5090 32.9277 55.3417 37.6895 31.8261 85.2251 70.5020 472.7110 627.1486 660.7211 313.9953 149.4876 292.6108 36.0962 62.2420 53.0392 38.6892 38.2005 16.8961 33.8605 72.4038 29.6626 10.7079 2.1665 2.5690 5.5693 11.2125 3.1452 2.4860 4.9071 21.4801 29.6543 11.2626 11.4417 10.1138 0.1545 2.0742
temp: 298.150 k
press: 1.00000 atm
elementType: 17 17 17 17 15 15 15 9 9 9 9 9 9 9 9 8 8 7 7 7 6 6 6 6 6 6 1 1 1 1 1 1
symmnumber: 1
zpe: 396148.8 jmol-1
zpe.correction: 0.150885 hartree
zpe.thermalcorrener: 0.182391 hartree
zpe.thermalcorrenthalpy: 0.183335 hartree
zpe.thermalcorrgfe: 0.079534 hartree
zpe.sumelectzpe: -4207.482594 hartree
zpe.sumelectthermal: -4207.451089 hartree
zpe.sumelectthermalent: -4207.450145 hartree
zpe.sumelectthermalfe: -4207.553945 hartree
dipole: -0.9491 2.9781 -0.0417
dipole: 3.1260
quadrupole: -217.6824 -210.4958 -205.7027
quadrupole: -3.1162 -2.3585 6.9649
quadrupole: -6.3887 0.7979 5.5909 -3.1162 -2.3585 6.9649
hfenergy: -4207.6334795 hartree
pointgroup: C01 [X(C6H6Cl4F8N3O2P3)]
dipole: 1.2017463 0.0862166 0.2468291 debye
polarizability: 220.2813457|3.0779803|246.894128|6.8523938|15.0327407|227.1075601 unknown
InChI: InChI=1S/C6H6Cl3F8N3O2P3.Cl/c7-23-18-24(8,9)20-25(19-23,21-1-5(14,15)3(10)11)22-2-6(16,17)4(12)13;/h3-4H,1-2H2;
charge 0 multiplicity 1
32 atoms
Cl -2.627194 -4.465547 -2.580507
Cl 0.696097 -5.100764 -2.290225
Cl -2.413215 -2.907625 2.818188
Cl 0.887803 -3.731749 2.696241
P  -0.338037 -0.940021 -0.742015
P  -0.865871 -3.742217 -1.460029
P  -0.745944 -2.972599 1.366408
F  -1.640732 1.317414 1.370942
F  -3.447977 2.032319 0.163267
F  1.333324 1.949964 0.934518
F  2.983575 2.157919 -0.633223
F  -2.532172 4.129381 1.587326
F  -1.725866 4.396248 -0.55071
F  4.086844 2.64199 1.763032
F  4.628266 0.462161 1.261515
O  -1.534493 0.200732 -1.18426
O  1.075363 0.013154 -0.99963
N  -0.239578 -1.428233 0.894271
N  -0.483183 -2.161743 -1.923591
N  -1.186286 -4.123828 0.184904
C  -1.367063 1.655585 -1.024644
C  2.222027 -0.079686 -0.088892
C  -2.036097 2.142763 0.26807
C  2.533868 1.329485 0.426807
C  -1.637326 3.595161 0.635818
C  3.553135 1.346813 1.595282
H  -1.884877 2.09716 -1.889455
H  -0.300152 1.931788 -1.041348
H  3.085054 -0.455674 -0.660585
H  1.99215 -0.749821 0.761751
H  -0.608516 3.659462 1.029389
H  3.103774 1.015009 2.547483
