program: Gaussian 16
title: Geometry optimalization of file_name
version: ES64L-G16RevC.01
method: UM062X
basis: 6-311+G(d,p)
operation: Freq
keyword: #N
keyword: Geom=AllCheck
keyword: Guess=TCheck
keyword: SCRF=Check
keyword: GenChk
keyword: UM062X/6-311+G(d,p)
keyword: Freq
converged: YES YES YES YES
elementType: C
elementType: H
1716.lowfreq: -3.7744 -0.0009 -0.0005 0.0004 0.4864 4.0440 6.0733 12.8804 15.2467
frequency: 5.9962 12.8615 15.2275 29.1085 42.3489 46.6712 48.2999 51.3877 53.8638 65.4746 73.1945 76.8730 93.4540 96.6911 108.8092 115.9523 125.5193 147.6121 163.7208 199.4100 221.0028 223.3149 233.5642 242.6576 245.8407 254.4675 272.7054 286.5027 289.9752 304.7025 326.6358 343.1699 388.2787 391.2907 399.7109 410.4603 415.7991 416.7298 419.4363 432.1719 443.2832 457.6882 468.5046 480.9756 490.4379 498.5950 512.6692 525.6867 536.3412 548.5257 551.5664 562.1978 588.8500 606.1756 616.4908 618.1021 627.0175 627.9433 629.5611 636.8003 644.6955 653.1663 669.4746 680.4657 695.7788 700.8832 710.6861 713.0752 717.8148 725.6540 730.2108 740.5162 747.7955 751.0264 756.1247 771.1972 774.2487 779.2333 779.4924 795.1813 798.7291 817.2193 845.0057 867.4022 870.4189 871.4716 874.3456 875.7692 875.9344 876.9498 880.6627 911.5809 916.3288 936.9088 939.4289 951.8366 955.4560 957.1073 958.0523 989.8301 997.8494 1000.4350 1007.7038 1009.4318 1012.4965 1014.0747 1016.3247 1016.5072 1016.7426 1017.4086 1021.8547 1023.8772 1024.3744 1027.5384 1044.3047 1045.1742 1057.4379 1060.0733 1060.3458 1064.1861 1085.3868 1105.9770 1111.0687 1116.2067 1130.9547 1137.2776 1155.7536 1158.9464 1173.8022 1177.1744 1177.4448 1178.2496 1185.1317 1194.2008 1204.2524 1205.5305 1206.8926 1208.2147 1214.5741 1239.7504 1255.8377 1258.2357 1281.6272 1294.5004 1304.0168 1305.9785 1308.3535 1313.7297 1323.0970 1327.3150 1336.6682 1348.3704 1351.2722 1353.6785 1367.3228 1394.5541 1408.6193 1414.5390 1434.8861 1435.9188 1470.6444 1478.5068 1480.2799 1484.3888 1485.3646 1490.5777 1492.7870 1504.8540 1512.1087 1530.9693 1535.6563 1538.8957 1541.9981 1576.2816 1589.4288 1595.4132 1624.6512 1636.2070 1636.9679 1639.9421 1643.7732 1645.9830 1661.9746 1670.8083 1674.9407 1698.9055 1705.2805 2312.4857 3190.7316 3193.1280 3198.3237 3198.6001 3198.6629 3200.6158 3200.8006 3203.2962 3207.7485 3208.8136 3208.9888 3209.2384 3211.6161 3213.7209 3214.2091 3216.2148 3216.4438 3218.5731 3221.5993 3222.0115 3223.8509 3226.0061 3227.3915 3228.8744 3229.7078 3229.7812 3230.3510 3258.5640
redmass: 5.8077 6.0234 6.2041 5.6403 5.6664 4.6969 4.9695 4.4128 5.2646 4.2816 4.1703 4.6622 5.6684 4.0765 5.9936 3.6590 6.3126 6.2781 4.8882 5.1965 5.6080 6.4994 4.7919 5.2388 5.4614 4.8147 4.6833 4.9273 5.0480 5.0996 5.8045 5.1386 4.7151 5.5414 6.7256 2.9457 4.0389 3.1382 3.0038 3.7741 5.9805 5.7060 4.3323 2.8293 4.3689 3.5511 4.6416 5.8043 5.4765 6.2047 4.2111 3.2683 6.6457 6.9190 4.0586 3.5935 6.3906 6.3791 6.3559 6.9796 7.0149 6.2997 6.6996 5.8238 6.0846 2.8652 2.4838 2.2922 2.6955 2.4181 1.8365 4.5510 4.4676 1.7491 4.5461 2.2269 2.2484 1.3694 2.5486 2.7374 2.4688 3.0243 1.4355 1.3833 1.8164 2.6566 4.5194 1.2566 1.4815 4.5519 1.2478 1.4419 1.5109 3.8205 6.6361 1.4795 1.4144 2.5498 1.9775 1.3243 1.3307 1.3455 1.4307 1.4291 1.3876 4.5725 1.2993 1.2970 5.1316 5.6941 1.3086 1.2932 1.3140 5.2325 2.1782 2.1978 3.1617 2.3508 2.4044 2.1229 2.5332 1.8101 1.5526 1.5837 1.9663 2.0826 2.1769 1.3923 1.9596 1.1648 1.1500 1.1455 1.3679 1.2052 1.2246 1.1207 1.1289 1.1454 2.2353 3.7839 1.6678 2.3533 2.9344 2.1361 2.5164 3.2555 3.8187 4.6812 3.0852 3.4123 2.3420 1.8099 1.4900 1.4461 2.9225 3.9485 5.4021 1.6365 4.2066 4.7477 5.5849 2.5680 2.5094 2.2845 2.3778 3.5407 2.9807 4.1468 3.0915 3.3559 4.4146 2.8210 2.9525 5.8204 6.6691 6.7824 6.5441 6.7374 5.9681 5.9332 5.8768 5.9527 5.7675 5.9590 6.0069 6.2225 6.0882 11.9972 1.0908 1.0878 1.0872 1.0862 1.0872 1.0856 1.0875 1.0887 1.0886 1.0889 1.0891 1.0916 1.0919 1.0905 1.0900 1.0927 1.0951 1.0955 1.0943 1.0944 1.0951 1.0990 1.0991 1.0961 1.0983 1.0980 1.0978 1.0940
irintensity: 0.0023 0.0806 0.2819 0.1315 0.0881 0.0158 0.1373 0.0206 0.0769 0.0945 0.0597 0.2360 1.6022 0.2217 0.1292 0.0005 0.0242 0.1677 0.0159 0.0903 0.2456 0.1328 0.0007 0.5929 1.1661 1.1745 1.5336 3.6711 0.6441 0.8515 12.4271 0.2726 0.1742 0.5381 0.7148 0.2611 0.8639 1.4216 4.1234 7.5271 3.6232 3.7242 0.2512 0.0065 0.8740 0.0003 1.4885 2.7340 7.2870 2.1289 6.2685 9.8976 5.7890 14.6525 6.5397 4.7609 0.0917 1.0403 0.8034 8.0066 14.3763 9.2360 11.3644 9.9224 5.7056 13.6781 28.7381 8.3683 10.8268 10.9118 94.8568 0.0100 4.7595 43.4818 16.1793 6.0840 52.1350 0.2354 4.1018 8.9736 16.2539 24.2298 19.9677 7.8629 3.4784 0.3509 12.1182 0.8410 0.0874 0.0627 0.8984 21.0366 27.7273 1.7591 0.0183 0.3555 2.5354 2.8215 1.8567 0.1514 0.0004 2.1862 2.6630 0.0072 0.3342 4.3285 0.0033 0.0006 5.2833 1.9238 0.3048 0.1577 0.5589 10.2108 9.6944 11.7404 0.9196 7.6242 7.7500 13.9924 85.7546 4.5007 1.5436 16.7876 1.3426 0.8592 38.5027 2.6605 2.2248 0.7134 0.7714 0.1255 3.1386 0.3467 1.3449 5.8621 2.6829 9.0012 2.1828 25.7429 0.8019 62.3377 15.5323 7.5744 2.0848 2.7161 3.2568 13.2848 1.3400 20.8022 0.6468 27.2228 4.3230 0.7925 95.6009 14.0882 27.6344 0.3150 7.8650 0.4416 47.9395 6.1981 44.4952 4.5701 1.8138 14.5784 19.3204 4.1963 71.6099 47.2817 340.7408 51.7055 43.3863 14.8334 10.8307 482.9351 142.4206 50.7122 44.9860 0.3389 1.8536 0.6995 3.1385 3.1016 10.9187 1.1813 2.7576 150.2892 1.0879 3.3645 0.1380 2.1443 1.2619 2.5538 0.1426 0.1594 1.5151 3.8264 15.0930 3.7811 1.9723 3.3231 1.1464 4.8043 9.4031 8.7788 8.2572 14.6338 10.0801 11.8862 18.0917 6.0002 12.6369 16.5266 5.7034 3.7242
temp: 298.150 k
press: 1.00000 atm
elementType: 6 6 6 6 6 6 6 6 6 6 6 6 6 1 1 1 1 6 6 6 6 6 1 6 1 6 1 1 1 6 6 6 6 1 6 1 6 1 1 1 6 6 6 6 1 6 1 6 1 1 1 6 6 6 6 6 6 6 6 1 6 6 6 1 6 6 1 1 1 6 1 1 1 1
symmnumber: 1
zpe: 1538498.4 jmol-1
zpe.correction: 0.585983 hartree
zpe.thermalcorrener: 0.620743 hartree
zpe.thermalcorrenthalpy: 0.621687 hartree
zpe.thermalcorrgfe: 0.513940 hartree
zpe.sumelectzpe: -1768.782939 hartree
zpe.sumelectthermal: -1768.748179 hartree
zpe.sumelectthermalent: -1768.747235 hartree
zpe.sumelectthermalfe: -1768.854983 hartree
dipole: -1.0748 -0.0651 0.0464
dipole: 1.0778
quadrupole: -216.5735 -231.5702 -275.3272
quadrupole: 0.9193 -1.0446 4.1956
quadrupole: 24.5835 9.5868 -34.1702 0.9193 -1.0446 4.1956
hfenergy: -1769.3689223 hartree
pointgroup: C01 [X(C46H28)]
dipole: -0.4230457 -0.0229681 0.0178276 debye
polarizability: 1169.2097012|-44.0895701|696.950498|-2.6229272|9.5372995|285.4574578 unknown
InChI: InChI=1S/C46H28/c1-4-14-32(15-5-1)43-42-30-37-28-31(25-27-41-38-22-12-10-20-35(38)29-36-21-11-13-23-39(36)41)24-26-40(37)46(42)45(34-18-8-3-9-19-34)44(43)33-16-6-2-7-17-33/h1-24,26,28-30H
charge 0 multiplicity 3
74 atoms
C  0.01491006 -1.66823257 0.00272993
C  1.39143363 -1.53717603 0.0117771
C  1.99965586 -0.26105968 0.00236813
C  1.21431236 0.90307807 -0.00368784
C  -0.16709063 0.78835936 -0.00502124
C  -0.78099602 -0.5158268 -0.01345636
C  -1.19708348 1.80796497 0.01339649
C  -2.42143342 1.14267131 0.02715948
C  -2.18683229 -0.29214937 -0.02052082
C  -3.81395173 1.3493721 0.02585207
C  -4.43337454 0.01425165 -0.00285794
C  -3.44556801 -0.96822321 -0.04329825
C  3.41871448 -0.15689804 0.00716758
H  -0.44040641 -2.65110818 0.02061929
H  2.02571141 -2.41444857 0.0284879
H  1.69691401 1.87340811 -0.00108354
H  -1.01578775 2.87259883 0.01210304
C  4.62522423 -0.06613658 0.01064078
C  -3.62678283 -2.43015018 -0.0595813
C  -4.49060564 -3.06966492 0.8361041
C  -2.91976877 -3.20570071 -0.98455715
C  -4.6416171 -4.45008585 0.80480383
H  -5.03950523 -2.47742547 1.55947949
C  -3.07375792 -4.58711612 -1.01631835
H  -2.25985493 -2.71346302 -1.69148044
C  -3.93523708 -5.21341828 -0.12098376
H  -5.3101179 -4.93246008 1.50811857
H  -2.52539466 -5.17338416 -1.74440121
H  -4.05570947 -6.28992242 -0.14379995
C  -5.88182686 -0.24039575 0.04781988
C  -6.68005421 0.39957444 1.00353125
C  -6.48213774 -1.13271625 -0.84808305
C  -8.044332 0.14580987 1.06620244
H  -6.22228334 1.09414248 1.69906571
C  -7.84831771 -1.37661085 -0.78991571
H  -5.86957429 -1.62987688 -1.59169669
C  -8.63277393 -0.74057787 0.16836353
H  -8.6492464 0.64248864 1.81547923
H  -8.30154352 -2.06459705 -1.49367982
H  -9.69789678 -0.9339445 0.21457416
C  -4.48405059 2.6416654 -0.01369656
C  -3.91412127 3.73545006 0.65861792
C  -5.66854293 2.84764239 -0.74035829
C  -4.51090564 4.98721899 0.61384979
H  -3.01282285 3.58242982 1.24112385
C  -6.2571833 4.10346904 -0.78817184
H  -6.1133505 2.02424419 -1.28547757
C  -5.68534062 5.17683277 -0.10988188
H  -4.06296158 5.81620454 1.14899456
H  -7.16488189 4.24652765 -1.36239313
H  -6.15081397 6.15447547 -0.14642941
C  6.04327269 0.04727676 0.01662267
C  6.84109443 -1.11766621 0.08708621
C  6.64360366 1.32575496 -0.0470032
C  6.27433814 -2.42632282 0.15271025
C  8.26715561 -0.99127139 0.09440619
C  8.07133456 1.43126866 -0.03834672
C  5.87400199 2.5258403 -0.12131043
C  7.07068404 -3.53038543 0.22054618
H  5.19555034 -2.52354513 0.14825329
C  9.06704267 -2.17448379 0.16645308
C  8.84797581 0.27507755 0.03204979
C  8.67053624 2.72811542 -0.10265229
H  4.79377301 2.44760139 -0.1295235
C  6.48229774 3.74399393 -0.1818271
C  8.48998918 -3.40537223 0.22758801
H  6.62404054 -4.51629429 0.26995355
H  10.1461617 -2.06582527 0.17127278
H  9.93016693 0.36294701 0.03834602
C  7.90311722 3.84977759 -0.17219088
H  9.75302065 2.79510048 -0.09492458
H  5.88296813 4.64485692 -0.23832902
H  9.10461716 -4.29580491 0.28193032
H  8.36660522 4.82773775 -0.22070662
