program: Gaussian 09
title: 000046438
version: EM64L-G09RevD.01
frameworkgroup: C1[X(C7H11BrO3)]
method: RPBEPBE
basis: SDD
operation: Freq
keyword: #p
keyword: freq=noraman
keyword: PBEPBE/SDD
title: #p freq=noraman PBEPBE/SDD
converged: YES YES NO NO
title: Mulliken charges:
elementType: Br O O O C C C C C C C H H H H H H H H H H H
charge: -0.006551 -0.261095 -0.207132 -0.267802 -0.348299 -0.584282 -0.512705 0.315139 0.276335 -0.762116 -0.505474 0.236287 0.263018 0.346305 0.252517 0.276390 0.250004 0.253768 0.260130 0.243102 0.238008 0.244456
chargesum: 0.00000
title: Mulliken charges with hydrogens summed into heavy atoms:
elementType: Br O O O C C C C C C C
charge: -0.006551 -0.261095 -0.207132 -0.267802 0.151006 -0.237977 0.016201 0.315139 0.276335 0.001785 0.220091
polarizability: 1.31053979e+02 6.07862886e+00 8.77660817e+01 5.05002074e+00 -1.48868060e+00 8.50029468e+01
1716.lowfreq: -8.2092 -5.1578 -0.0003 0.0003 0.0005 8.9757 20.8419 28.1332 68.8166
frequency: 20.4954 28.0990 68.8094 87.1746 99.4394 127.8210 140.0549 152.0898 176.2159 200.2657 239.3494 262.7306 313.7270 402.7939 429.6477 492.0915 563.1768 582.0771 645.4722 698.2227 754.3532 803.5187 876.8827 920.9528 952.0942 1001.2397 1014.0367 1034.2468 1093.3804 1112.4351 1133.5175 1143.7944 1150.7517 1177.3267 1214.6729 1255.2197 1307.9173 1344.9228 1367.5959 1372.3412 1422.6953 1444.0469 1452.5675 1452.8695 1455.4456 1458.0707 1462.7842 1619.4541 1627.0887 2983.3734 3007.6551 3013.0362 3021.9638 3073.2390 3082.9175 3093.9963 3110.7790 3114.6595 3129.0475 3154.4763
redmass: 5.3072 5.1400 4.4518 3.0332 1.3040 1.2174 3.1956 3.7281 4.5284 6.6147 3.6480 2.4147 5.0245 3.2794 3.1677 3.0089 3.6929 3.6888 3.4251 3.3910 3.4880 3.8845 2.5908 3.2014 2.1001 2.3459 1.8171 2.1626 3.4121 1.2757 1.4538 1.4491 1.4655 1.6763 1.8857 1.3994 1.3851 1.4490 1.2843 1.4288 1.2041 1.0672 1.0664 1.0504 1.0836 1.0936 1.0511 8.4059 8.0226 1.0387 1.0298 1.0632 1.0598 1.0936 1.1001 1.0992 1.1047 1.0888 1.1009 1.1050
irintensity: 0.5560 2.4177 6.9211 0.1875 0.6903 0.8119 1.5432 3.1459 1.7112 1.2006 16.3584 1.5436 38.3671 5.6617 12.0947 5.7270 8.1188 6.0243 17.5793 13.7274 9.5881 8.4566 19.7256 4.7125 14.9404 10.2373 14.2567 11.8370 75.7914 1.1747 98.5310 69.4161 47.3994 24.2856 103.3773 42.6924 17.8805 30.6925 58.0516 54.2434 18.5060 25.0161 25.5986 13.6793 17.4645 17.6929 16.1481 91.4263 180.1427 0.4085 31.1188 8.0942 12.8857 6.2420 6.2160 7.5420 24.5661 0.8411 11.7576 15.8120
temp: 298.150 k
press: 1.00000 atm
elementType: 35 8 8 8 6 6 6 6 6 6 6 1 1 1 1 1 1 1 1 1 1 1
symmnumber: 1
zpe: 448247.4 jmol-1
zpe.correction: 0.170728 hartree
zpe.thermalcorrener: 0.184240 hartree
zpe.thermalcorrenthalpy: 0.185185 hartree
zpe.thermalcorrgfe: 0.127395 hartree
zpe.sumelectzpe: -511.604798 hartree
zpe.sumelectthermal: -511.591286 hartree
zpe.sumelectthermalent: -511.590342 hartree
zpe.sumelectthermalfe: -511.648131 hartree
dipole: 3.2319 -0.7475 -1.4408
dipole: 3.6166
quadrupole: -65.9370 -75.4872 -77.6940
quadrupole: -2.7053 -0.1416 -4.4793
quadrupole: 7.1024 -2.4478 -4.6546 -2.7053 -0.1416 -4.4793
hfenergy: -511.7755266 hartree
pointgroup: C01[X(C7H11Br1O3)]
dipole: -1.3705084 -0.0053946 -0.3823853 debye
dipolederiv: -0.4840546 -0.1509755 0.1700025 -0.2014239 -0.3382476 0.1376391 0.1531425 0.0968749 -0.2028814 -1.604913 -0.0012123 0.0418311 0.1348267 -0.3227192 -0.0769062 0.0817243 -0.0827991 -0.4237186 -0.3518445 0.1650715 -0.0533367 0.0735738 -0.563754 0.0795242 0.0846846 0.0962858 -0.82821 -0.8830216 -0.0393496 0.0069347 0.1845759 -0.4458201 -0.2151634 0.3480566 -0.2302944 -0.7033962 0.0307311 0.0168884 0.0802207 -0.0868076 0.0265555 0.0244939 -0.0188832 -0.0400696 -0.0038284 0.6789933 0.3471371 -0.205083 0.287923 -0.0726472 -0.0520869 -0.2265962 -0.0729459 0.1091767 -0.225873 -0.0829156 -0.0886025 0.0595802 0.0683015 -0.0443845 -0.100392 -0.0360577 -0.0794085 0.0756076 -0.3983599 0.0404218 -0.1448435 1.0697926 0.019016 -0.0779262 0.0352622 0.9304009 1.8812149 -0.0229724 -0.047373 -0.4022096 0.355014 0.3209695 -0.3922053 0.3581205 0.7885779 0.0347457 0.030267 -0.0094156 0.0814661 -0.2723516 -0.2509175 0.0604092 -0.2700729 -0.2973979 0.5857495 0.0372285 0.0664799 0.1101869 0.2705311 -0.0108239 0.1924725 -0.0049871 0.2671017 0.0322583 0.0604838 0.0014919 0.0537688 -0.0823639 0.0400855 0.0248372 0.0731788 0.0513743 -0.0105178 -0.0610213 -0.0815753 -0.0260643 0.093097 -0.0146997 -0.0356624 -0.0329324 -0.0030208 0.0338637 -0.0231343 -0.0366192 -0.0327124 0.0277137 -0.0304669 0.0085015 0.0096826 0.0038079 -0.0148528 0.0269356 0.093841 -0.0002942 0.0384262 -0.0791869 0.0640678 -0.0662239 0.0182031 0.1426287 0.0160698 -0.0773954 -0.0397988 -0.0171656 0.0433504 -0.044877 0.0194349 0.0967049 0.0741843 -0.0144537 0.0912926 -0.0696611 0.050177 0.0878854 0.0516297 0.0645316 0.0332017 0.0568779 0.1124141 -0.0071935 0.0904131 -0.0243011 0.0238768 -0.0468787 0.0586255 0.0674794 -0.0198767 -0.0450203 -0.0440585 -0.0247951 0.1080357 -0.0277808 -0.0410393 0.0006229 0.1091112 0.0253922 -0.0448655 0.0323321 -0.0451748 0.036888 0.0827025 -0.0877135 0.0760926 -0.0715967 -0.0947653 0.0279366 0.046964 0.0535856 0.1039334 -0.0347048 0.0867995 -0.0356315 0.0608183 0.0374723 0.0438479 -0.0211597 -0.056115 -0.1090953 -0.0224216 -0.0841515 -0.0166976 0.0775004 unknown
polarizability: 124.6954615|12.8357737|91.5320539|-12.1604328|-1.943835|87.5954918 unknown
InChI: InChI=1S/C7H11BrO3/c1-5(9)6(8)3-4-7(10)11-2/h6H,3-4H2,1-2H3
charge 0 multiplicity 1
22 atoms
Br 2.844515 1.55921 -0.973597
O  -3.057047 0.182606 0.59204
O  1.947226 -1.23289 1.229926
O  -1.46372 -0.704383 -0.849514
C  0.455961 1.160793 0.686769
C  1.221537 0.412095 -0.409976
C  -0.755089 0.369842 1.264834
C  1.808502 -0.94726 0.010492
C  -1.746371 -0.104383 0.219628
C  2.13361 -1.919871 -1.105714
C  -4.11357 -0.285531 -0.342021
H  0.117687 2.132522 0.284641
H  1.142833 1.362089 1.526979
H  0.65466 0.3172 -1.346658
H  -1.280177 0.993798 2.005861
H  -0.367322 -0.522094 1.792558
H  2.672972 -1.420961 -1.929792
H  2.725563 -2.764073 -0.721018
H  1.17994 -2.303395 -1.519752
H  -3.998451 0.207212 -1.321826
H  -5.058321 0.001668 0.139271
H  -4.047539 -1.378095 -0.47533
