program: Gaussian 16
title: Geometry optimalization of file_name
version: ES64L-G16RevC.01
method: UM062X
basis: 6-311+G(d,p)
operation: Freq
keyword: #N
keyword: Geom=AllCheck
keyword: Guess=TCheck
keyword: SCRF=Check
keyword: GenChk
keyword: UM062X/6-311+G(d,p)
keyword: Freq
converged: YES YES YES YES
elementType: C
elementType: N
elementType: O
elementType: H
1716.lowfreq: -0.0008 -0.0006 -0.0003 1.3282 3.6620 6.0564 24.8861 33.7652 36.5774
frequency: 24.8803 33.7632 36.5735 47.8125 49.9317 54.2801 58.6954 68.1203 73.8697 94.7337 98.7480 154.7898 166.9636 187.9783 205.8179 223.6076 229.9832 240.7228 253.0295 275.8078 292.3263 321.8693 335.2537 391.6592 399.5382 409.1558 415.9210 418.9430 435.1737 469.0378 484.1524 508.3825 527.1246 551.5693 556.6388 559.1307 572.8656 624.2684 626.7352 628.9054 633.1280 666.4203 676.9119 693.9687 702.1632 710.9127 713.0390 720.4163 724.4471 736.9625 737.6633 748.4834 771.7858 783.9714 794.9144 799.4493 816.5055 851.4746 853.7370 872.4769 873.4875 873.8887 879.7705 929.2878 940.8485 953.7420 955.8740 957.6846 962.6938 994.3964 1007.9779 1010.2190 1011.5399 1014.3548 1016.4339 1017.7635 1023.7060 1024.9924 1025.2270 1030.4818 1059.1425 1060.3264 1063.2932 1089.0014 1103.3381 1104.7684 1111.4422 1116.6710 1134.3172 1162.0020 1177.7417 1178.4428 1179.0528 1182.9727 1206.1592 1207.0825 1208.7430 1223.2072 1254.5128 1274.6097 1300.3955 1307.5543 1311.4442 1319.3783 1341.6431 1348.8023 1353.8282 1354.3217 1369.0675 1394.5719 1434.2656 1451.8998 1477.3413 1480.4477 1485.4275 1489.8540 1502.2084 1511.6273 1532.8892 1540.7033 1543.1594 1581.0799 1624.2287 1629.5557 1636.3838 1643.4835 1647.4818 1660.0791 1669.7837 1675.3725 1700.1204 3193.0817 3200.7936 3201.9280 3202.6945 3205.5838 3209.6662 3210.9733 3212.4805 3217.4783 3218.6022 3220.3829 3224.2882 3226.3219 3227.9627 3228.8472 3230.9035 3245.8571 3257.9054 3261.1607
redmass: 6.3916 11.6126 7.0278 4.4572 4.9344 4.7972 6.1365 4.3576 4.1977 6.2322 3.9169 5.7913 5.4966 6.5269 8.3814 6.3782 5.6390 5.6091 4.8999 4.6544 4.4258 6.2985 6.3541 6.9466 4.9125 2.9175 2.9526 2.9664 3.6219 5.2540 4.9238 4.3812 4.4645 4.3893 4.2806 4.8477 6.8817 6.7307 6.3970 6.3397 6.7892 6.9103 5.7240 2.8638 5.7367 2.1113 2.2793 2.3798 2.6033 2.3198 4.2393 5.1233 2.6821 2.2474 2.6856 2.3882 3.0030 2.9580 2.0663 5.8023 1.2457 1.2720 1.2533 1.4005 4.7390 1.4268 1.4185 1.5353 3.8420 1.3214 1.4024 1.6427 1.3833 3.3838 5.3137 5.6926 1.3003 1.2978 1.3008 5.6247 2.3875 2.2782 2.0389 2.2780 1.9933 1.8824 1.5502 1.5993 2.1311 1.8577 1.1703 1.1992 1.1416 2.7661 1.1209 1.1268 1.1432 2.6029 3.5546 2.2015 2.6404 4.1369 3.7796 3.6402 5.3614 1.7364 1.6769 1.4999 2.9791 4.4107 3.5155 10.9167 2.5302 2.5978 2.4464 3.5636 3.5438 2.9443 3.7089 2.6637 3.8922 6.3862 7.9985 6.5207 5.6436 5.8753 5.9564 5.7426 5.9210 6.0239 12.8695 1.0886 1.0862 1.0859 1.0872 1.0888 1.0885 1.0913 1.0921 1.0927 1.0952 1.0955 1.0951 1.0914 1.0990 1.0992 1.0985 1.0924 1.0935 1.0943
irintensity: 0.1270 0.0070 0.0015 0.0182 0.0258 0.1947 0.2610 0.5415 0.1113 1.5615 0.3148 0.4825 0.3863 1.5432 0.5827 0.2813 0.0839 0.2344 0.4695 0.7087 1.9249 0.3020 0.7512 3.4711 0.8295 0.8141 0.5511 2.7046 5.6972 5.9224 0.7973 0.9673 4.8614 5.5736 0.8894 8.8586 7.7746 0.8228 0.1872 0.1237 0.2188 0.1882 14.3368 11.7154 4.4041 16.6547 39.2907 22.3868 4.5003 50.7341 52.9109 4.3293 2.2460 6.0463 24.1629 19.9103 22.4408 27.5082 19.2155 17.2266 3.3020 1.7888 0.7956 20.0829 22.0691 2.2539 2.9632 2.6279 13.8323 0.3918 0.5046 1.8779 0.3046 0.9811 5.3128 1.1046 0.0170 0.1387 0.0786 0.1169 10.3964 6.8131 4.2349 1.7427 89.8069 6.3541 1.4463 9.2628 5.3136 7.7074 0.6060 0.1461 0.6128 5.1265 1.7690 2.6532 7.4790 1.8761 46.3465 0.3333 20.2086 9.0452 3.7629 15.7812 10.2518 8.4185 2.0694 1.9027 29.4090 31.7341 78.7218 760.3775 9.4684 35.4167 3.8633 36.4879 24.4163 43.9649 140.8651 8.3077 79.7479 8.0677 105.1788 13.6565 4.0217 1.3225 3.8765 0.1755 0.7514 9.2212 249.7101 2.7644 1.1149 1.8643 0.2159 0.0853 0.8734 2.8617 1.6085 3.3262 8.8306 7.7163 8.8730 2.7443 10.4249 12.1958 9.5255 5.7531 8.7484 2.6020
temp: 298.150 k
press: 1.00000 atm
elementType: 6 6 6 6 6 6 6 6 6 6 6 6 7 8 8 1 1 1 1 6 6 6 6 1 6 1 6 1 1 1 6 6 6 6 1 6 1 6 1 1 1 6 6 6 6 1 6 1 6 1 1 1
symmnumber: 1
zpe: 1060095.3 jmol-1
zpe.correction: 0.403769 hartree
zpe.thermalcorrener: 0.428872 hartree
zpe.thermalcorrenthalpy: 0.429816 hartree
zpe.thermalcorrgfe: 0.345635 hartree
zpe.sumelectzpe: -1359.064907 hartree
zpe.sumelectthermal: -1359.039804 hartree
zpe.sumelectthermalent: -1359.038859 hartree
zpe.sumelectthermalfe: -1359.123041 hartree
dipole: 8.0633 1.2955 -0.0121
dipole: 8.1667
quadrupole: -225.0780 -167.7677 -190.2593
quadrupole: -10.1467 2.1481 -4.7313
quadrupole: -30.7097 26.6006 4.1090 -10.1467 2.1481 -4.7313
hfenergy: -1359.4686758 hartree
pointgroup: C01 [X(C30H19N1O2)]
dipole: -3.1822453 0.4431077 0.0244661 debye
polarizability: 609.8716657|22.2752788|450.9999509|1.8846015|14.687354|210.1507642 unknown
InChI: InChI=1S/C30H19NO2/c32-31(33)24-16-17-25-23(18-24)19-26-27(20-10-4-1-5-11-20)28(21-12-6-2-7-13-21)29(30(25)26)22-14-8-3-9-15-22/h1-19H
charge 0 multiplicity 3
52 atoms
C  3.14126904 1.2205561 -0.0745717
C  4.49752817 0.92661303 -0.09589323
C  4.90040664 -0.40948653 -0.07404325
C  4.02113405 -1.48400901 -0.04437869
C  2.661929 -1.19641128 -0.02925402
C  2.21963859 0.17252635 -0.03352175
C  1.51487515 -2.08112676 -0.02143464
C  0.38193738 -1.2710574 -0.03232192
C  0.78823068 0.12324935 -0.00788524
C  -1.02606677 -1.30463185 -0.00673049
C  -1.47513014 0.10367486 0.00755254
C  -0.37135777 0.95391749 0.02182743
N  6.34866557 -0.69982359 -0.09274924
O  6.68946566 -1.86388293 -0.0792811
O  7.11167416 0.24231573 -0.11979888
H  2.80724216 2.25033648 -0.10106975
H  5.24722292 1.70408393 -0.13127362
H  4.40348168 -2.49595182 -0.03801663
H  1.56537698 -3.15961487 -0.00578531
C  -0.36417913 2.42777882 0.01443698
C  -1.13712727 3.15546044 -0.89624859
C  0.43348785 3.12146707 0.9301217
C  -1.11107192 4.54418134 -0.88859114
H  -1.75525508 2.62538123 -1.61201465
C  0.45687989 4.51165984 0.93784114
H  1.0228344 2.56209324 1.64949132
C  -0.31556089 5.22659832 0.02793501
H  -1.7103347 5.09584016 -1.60314867
H  1.07363488 5.03591219 1.65829772
H  -0.29764097 6.30983144 0.03214997
C  -2.87962481 0.5343286 -0.0380128
C  -3.76283573 -0.03511546 -0.96386534
C  -3.35217666 1.52592201 0.83003886
C  -5.0850979 0.38530116 -1.02517594
H  -3.40420649 -0.80457094 -1.63831094
C  -4.67830186 1.93432036 0.774895
H  -2.67383818 1.9688118 1.55038268
C  -5.54708894 1.36801656 -0.15426219
H  -5.75631793 -0.05692249 -1.75158353
H  -5.03431963 2.69643261 1.45770459
H  -6.58045655 1.69069689 -0.19852252
C  -1.84969128 -2.50017447 0.07205808
C  -1.4300241 -3.67107065 -0.58188717
C  -3.03804702 -2.54022041 0.82091211
C  -2.1768528 -4.83690368 -0.49889983
H  -0.52728007 -3.64444209 -1.18134039
C  -3.77565152 -3.71211203 0.90844131
H  -3.36713524 -1.65655762 1.35339866
C  -3.35255392 -4.86234955 0.24713909
H  -1.8452107 -5.72677761 -1.02052897
H  -4.68302817 -3.7296841 1.50023183
H  -3.93439369 -5.77371226 0.3144771
