program: Gaussian 16
title: Geo opt name of file
version: ES64L-G16RevC.01
frameworkgroup: C1[X(C13H7N)]
method: UM062X
basis: 6-311+G(d,p)
operation: Freq
keyword: #N
keyword: Geom=AllCheck
keyword: Guess=TCheck
keyword: SCRF=Check
keyword: GenChk
keyword: UM062X/6-311+G(d,p)Freq
converged: YES YES YES YES
elementType: C
elementType: N
elementType: H
1716.lowfreq: -4.4081 -0.0007 -0.0002 0.0004 2.6895 13.4081 64.7026 128.8569 151.7060
frequency: 64.7015 128.8569 151.7059 170.9938 247.2443 302.0105 324.9852 373.8567 428.5940 486.5358 508.8512 519.0111 553.0649 595.9735 629.6138 646.3301 685.5190 716.8788 731.9080 737.1905 769.2964 778.7609 808.3854 843.1716 843.9096 922.8430 933.4604 943.3143 979.1738 982.3257 1007.6634 1073.1674 1094.3173 1148.8581 1166.3998 1183.9462 1247.1902 1281.7974 1291.1673 1306.2765 1335.2531 1373.4201 1385.3109 1472.7912 1496.3920 1514.7173 1558.4181 1610.8349 1632.4225 2397.4223 3215.9791 3222.3782 3236.6532 3243.3831 3260.3758 3261.8443 3273.0261
redmass: 7.4018 8.7776 4.5660 4.8480 5.1838 6.1892 3.3658 8.4712 3.4203 4.8909 5.2153 2.4648 6.2353 5.9786 3.5638 6.5547 3.1052 6.3461 2.2618 1.3505 2.1893 6.5906 1.7150 5.0063 1.4366 1.4267 1.3802 2.7344 2.2945 1.3338 2.5054 3.4977 1.4966 1.6074 1.4958 2.0809 2.4993 1.6662 4.3882 2.7381 2.8856 2.2529 4.6102 3.5063 3.8434 4.3047 8.1444 7.1308 5.8038 12.6841 1.0898 1.0929 1.0956 1.0902 1.0935 1.0942 1.1017
irintensity: 0.3715 3.5796 5.5370 2.9039 3.1662 0.6027 1.9814 2.4163 1.8502 8.2651 0.3421 2.0938 2.2406 1.0106 1.0383 0.3798 4.5555 0.2029 19.7548 42.7789 38.3543 0.3368 1.0422 3.9922 25.6060 19.5407 0.0325 1.5870 2.5543 0.0102 1.4151 17.1971 8.3894 6.9717 6.9861 17.6376 2.4609 8.8490 1.7089 15.4430 4.1695 10.8445 5.5890 23.5502 5.7418 12.5214 149.1618 104.1113 12.1539 51.9452 1.8152 0.1998 0.4765 1.0756 8.7961 1.4975 2.7578
temp: 298.150 k
press: 1.00000 atm
elementType: 6 6 6 6 6 6 6 6 6 6 6 6 6 7 1 1 1 1 1 1 1
symmnumber: 1
zpe: 407327.7 jmol-1
zpe.correction: 0.155143 hartree
zpe.thermalcorrener: 0.165191 hartree
zpe.thermalcorrenthalpy: 0.166136 hartree
zpe.thermalcorrgfe: 0.118357 hartree
zpe.sumelectzpe: -553.997833 hartree
zpe.sumelectthermal: -553.987785 hartree
zpe.sumelectthermalent: -553.986841 hartree
zpe.sumelectthermalfe: -554.034619 hartree
dipole: -5.5218 0.7562 0.0000
dipole: 5.5733
quadrupole: -97.8297 -68.6905 -85.6973
quadrupole: 3.4601 -0.0000 0.0000
quadrupole: -13.7572 15.3820 -1.6248 3.4601 -0.0000 0.0000
hfenergy: -554.1529761 hartree
pointgroup: C01 [X(C13H7N1)]
dipole: 2.086188 0.6006612 -0.3082339 debye
dipolederiv: 0.3259096 0.1338709 -0.0653383 -0.1602507 0.1154134 -0.0237246 -0.0128758 -0.052076 -0.0936703 -0.2885157 -0.157504 0.0437126 -0.1076671 -0.139619 0.0127211 0.0348228 0.0175247 -0.132969 -0.0040825 -0.0511951 0.0148204 0.0797207 0.2601414 -0.0442876 -0.0085309 -0.0316676 0.061404 -0.1174573 0.1498268 -0.0252868 0.0274563 0.0622321 -0.0320367 -0.0034593 -0.0438322 -0.0943898 0.2413333 -0.1353304 0.0010264 -0.0986857 -0.1337282 0.0336437 -0.0055103 0.0371761 -0.0045384 -0.6362636 -0.1078935 0.0796101 0.1736589 -0.0642388 -0.0070709 0.0293899 0.0200691 -0.0164436 0.5314775 0.1545417 -0.092693 0.4366217 0.2311471 -0.10903 -0.1430058 -0.0818389 -0.1157767 -1.3530457 -0.3192382 0.1811973 -0.4587985 -0.3906609 0.1024889 0.2060925 0.0890372 -0.0997578 0.6188442 0.1135065 -0.0739178 0.0343116 0.0843184 -0.0072797 -0.0597921 -0.0149147 0.070466 0.5992581 0.1103867 -0.0885578 -0.1382694 0.1635857 -0.0363934 -0.0442062 -0.0603644 -0.1001491 0.0567053 0.0775244 -0.0314358 0.2183597 0.0312579 -0.0490919 -0.0565552 -0.0355152 -0.1141825 -0.1879761 -0.0254302 0.0036047 -0.0823208 -0.0937812 -0.0105889 0.0137497 -0.0160722 -0.1960897 0.5145506 0.1029789 -0.0575703 0.1571211 0.0767454 -0.0095955 -0.0672275 -0.0043765 0.1151215 -0.5943923 -0.0585959 0.0382884 -0.1016292 -0.3071934 0.010079 0.0459641 0.0059308 -0.3110976 0.0550838 -0.0404849 0.0148064 -0.001113 -0.0209775 0.0277098 0.0077836 0.0315049 0.127404 0.0203681 0.0458335 0.0043525 0.0389703 0.0523659 0.0137176 0.0055767 0.013056 0.1474662 0.0710992 -0.0018281 0.0073565 -0.0243914 0.0018813 0.0277065 0.011381 0.0255314 0.1383827 0.0566269 0.0020446 0.0095677 0.0081455 -0.0146878 0.0303138 0.0084792 0.0309017 0.1533372 0.0207592 0.0350895 0.0069591 0.0720109 0.0250729 0.0167467 0.0003711 0.020306 0.1542234 -0.0168195 -0.048395 0.025032 -0.0647989 0.0662907 0.0217687 0.0279605 0.0201878 0.1470219 0.0865369 0.0202918 0.0044656 -0.0084519 -0.0055654 0.0322032 0.0095919 0.0294318 0.1642375 unknown
polarizability: 298.467836|22.5172038|144.7659901|-25.5778627|-14.6526893|79.8647388 unknown
InChI: InChI=1S/C13H7N/c14-8-9-4-5-13-11(6-9)7-10-2-1-3-12(10)13/h1-7H
charge 0 multiplicity 3
21 atoms
C  -1.21809247 1.40573102 -0.13331925
C  -2.51362313 0.96029502 0.07101224
C  -2.75670104 -0.40058708 0.33718026
C  -1.72192566 -1.33846483 0.40472162
C  -0.41804434 -0.90323154 0.20140526
C  -0.16773272 0.48806299 -0.07088449
C  0.83313554 -1.63026615 0.21047775
C  1.84501497 -0.70057749 -0.05288747
C  1.24235939 0.61993864 -0.23033007
C  3.22150865 -0.54714838 -0.21294339
C  3.46440081 0.86472219 -0.48818085
C  2.28105113 1.56692415 -0.49936655
C  -4.10927062 -0.83639623 0.54529275
N  -5.19314966 -1.18534351 0.71201203
H  -1.02465532 2.45186923 -0.33856188
H  -3.34958055 1.64621942 0.02924629
H  -1.94645038 -2.37768752 0.6117271
H  0.93514012 -2.69004407 0.3896743
H  3.98553509 -1.3075116 -0.15096957
H  4.44486707 1.28829282 -0.65824125
H  2.16621512 2.62520092 -0.67705984
