program: Gaussian 16
title: Geometry optimalization of file_name
version: ES64L-G16RevC.01
method: RM062X
basis: 6-311+G(d,p)
operation: Freq
keyword: #N
keyword: Geom=AllCheck
keyword: Guess=TCheck
keyword: SCRF=Check
keyword: GenChk
keyword: RM062X/6-311+G(d,p)
keyword: Freq
converged: YES YES YES YES
title: Mulliken charges:
elementType: C C C C C C C C C C C C O C H H H H H H H C C C C H C H C H H H C C C C H C H C H H H C C C C H C H C H H H
charge: 0.007847 -0.462013 -0.806457 0.109859 0.271854 -0.165757 -0.128824 0.172406 -0.005695 0.159465 0.005586 0.252111 -0.120950 -0.306718 0.197031 0.157775 0.158853 0.176103 0.182766 0.166094 0.165085 0.882983 -0.136224 -0.703897 -0.396323 0.177795 -0.294183 0.168993 -0.198893 0.154714 0.155308 0.158913 0.493386 -0.297319 -0.178034 -0.425806 0.169338 -0.443536 0.171146 -0.072514 0.155486 0.154361 0.157004 0.801233 -0.586459 -0.122663 -0.293411 0.151566 -0.465342 0.178102 -0.169676 0.155213 0.155131 0.157188
chargesum: -0.00000
title: Mulliken charges with hydrogens summed into heavy atoms:
elementType: C C C C C C C C C C C C O C C C C C C C C C C C C C C C C C C C
charge: 0.204878 -0.304238 -0.806457 0.268711 0.271854 -0.165757 0.047279 0.172406 -0.005695 0.159465 0.005586 0.252111 -0.120950 0.207227 0.882983 0.041571 -0.534904 -0.241609 -0.138875 -0.039980 0.493386 -0.127981 -0.006887 -0.270320 -0.289175 0.084489 0.801233 -0.434893 0.055439 -0.138198 -0.310212 -0.012488
1716.lowfreq: -4.9120 -3.5392 -0.0006 0.0005 0.0007 1.3594 26.3046 35.7415 46.3736
frequency: 26.3002 35.7356 46.3706 49.5572 52.1921 57.3638 61.5774 70.0275 83.4415 93.8653 115.9036 160.5865 165.9501 201.9305 211.0546 224.7787 238.0986 247.6691 250.0893 274.0516 280.0606 304.2361 341.7291 354.2165 412.1269 416.2243 416.6035 419.3758 432.5542 451.4253 469.5861 497.0314 508.3529 533.5179 547.7509 570.1049 585.4636 626.4849 628.1460 630.1460 630.3923 651.1596 672.8337 683.1773 711.0629 716.3369 718.0165 722.6936 728.2437 737.1194 755.7922 769.3615 781.0960 798.3034 803.1144 819.2127 853.7417 868.3271 875.1039 875.7600 878.0810 880.2983 918.9107 950.0272 953.1176 953.4724 958.3798 962.5903 981.5462 1005.1893 1008.2632 1009.0169 1012.3926 1017.1109 1017.8327 1018.3553 1022.4487 1022.6961 1025.0059 1058.9852 1061.3184 1064.0765 1092.9102 1102.6875 1110.3811 1110.9081 1116.3639 1132.3253 1151.7467 1176.0817 1176.9872 1177.3371 1181.4223 1183.9962 1199.9777 1204.7054 1205.7976 1206.5958 1215.9765 1262.0738 1286.0492 1296.3622 1307.8158 1311.8679 1316.4595 1323.0933 1332.0075 1349.4608 1351.0972 1352.3064 1388.6713 1418.0810 1468.8561 1480.9890 1483.2258 1485.0807 1488.8125 1508.6741 1518.7191 1521.1340 1529.0976 1538.4000 1543.5093 1631.0916 1643.1770 1644.5475 1648.7558 1656.8939 1670.6438 1674.5375 1674.9885 1678.9144 1688.7210 1718.3035 3039.4643 3103.3493 3174.6633 3196.1169 3197.4084 3197.6598 3201.8519 3202.1110 3204.6004 3210.1544 3210.6386 3212.1170 3214.2216 3217.2138 3217.3434 3218.6986 3226.4165 3226.9184 3227.1666 3230.6940 3233.2145 3234.1883
redmass: 5.3925 5.0243 4.3052 4.3735 5.0760 4.5919 4.3434 4.0276 3.6683 3.9693 5.3227 4.8155 4.6698 4.1683 4.6557 6.0013 4.8155 4.7049 4.2574 2.7204 2.0642 2.8602 4.7301 4.4116 2.9977 4.2768 3.3927 2.9517 4.3867 3.5481 4.4833 4.2727 4.2882 4.3766 4.5546 4.4307 6.6575 3.6121 5.4198 6.2940 6.1356 6.9239 6.4854 5.6275 3.9354 2.2020 2.0119 2.5777 1.8203 2.9229 3.3825 4.3906 4.6577 2.8483 2.5479 3.0457 1.4178 1.5032 1.2487 1.3798 2.5539 1.5524 1.5442 2.7831 1.4675 1.4464 1.4780 6.4784 1.3370 4.8830 1.3984 1.4744 1.3818 5.5682 5.4953 4.9758 1.2988 1.3110 1.3073 2.3939 2.1573 1.9511 2.5243 1.9063 1.5528 1.7200 2.2811 2.3085 1.7746 1.1480 1.1657 1.1437 2.3137 1.2783 1.9790 1.1197 1.1223 1.1352 1.6033 4.2319 1.6764 4.1751 4.3480 4.1100 4.7141 4.6195 2.8538 1.4843 1.4516 1.4824 4.5064 4.5282 2.2863 2.3096 2.2432 2.3592 1.8115 1.0431 1.0844 2.4279 2.4145 2.5975 2.7176 7.5012 5.9934 5.9027 6.8741 7.6141 6.2914 6.3586 6.2014 7.0606 8.1668 11.2636 1.0352 1.1061 1.0997 1.0869 1.0862 1.0857 1.0883 1.0882 1.0881 1.0917 1.0919 1.0921 1.0895 1.0955 1.0953 1.0953 1.0990 1.0990 1.0990 1.0946 1.0908 1.0964
irintensity: 0.1458 1.4285 0.2018 0.1070 0.1230 0.3183 0.2716 0.1224 1.0243 0.0331 1.6232 0.5012 0.1666 1.4501 0.6173 1.4141 0.1955 0.4892 0.7288 0.0345 2.1314 0.6727 1.6081 0.0778 0.3219 0.3585 0.5231 0.9822 0.6869 6.2828 1.0722 10.4267 5.6388 6.1065 7.9121 10.3611 2.0889 0.6546 0.3250 0.1186 0.0649 0.6980 0.9815 10.2259 11.7331 8.8926 31.4942 42.9921 70.5474 3.1636 3.3717 26.9738 3.9350 37.7367 7.1034 21.9585 23.1491 15.9878 1.2106 0.7560 0.6459 1.5878 20.1737 15.5472 4.9163 3.1550 2.5430 4.3170 0.0885 15.8401 0.0033 1.5887 0.6399 1.5674 0.1059 0.4547 0.1536 0.1555 0.1084 14.7495 3.8372 0.2806 9.0192 1.4328 3.9061 8.6948 31.7939 10.8533 14.2126 0.1777 2.6103 0.7175 90.7328 0.8521 7.1972 0.8774 1.2399 3.3315 4.5460 50.9877 99.8435 1.1265 4.7999 2.6895 4.8783 108.9319 154.2935 1.1606 0.8141 0.9104 21.7876 25.6472 7.0545 7.0653 10.2789 2.7458 66.6973 10.5233 15.1985 196.0087 55.4706 43.3519 7.0795 8.6160 2.7278 3.0718 3.3924 7.7035 23.8037 1.9759 21.8729 129.4370 3.5828 11.0595 50.6332 28.4119 25.0585 1.8334 2.4435 2.8834 0.1517 0.0434 0.3024 3.7197 3.3375 5.4202 1.6586 19.8810 2.4672 10.7841 13.4881 11.7617 11.6003 2.4885 4.6422 3.4616
temp: 298.150 k
press: 1.00000 atm
elementType: 6 6 6 6 6 6 6 6 6 6 6 6 8 6 1 1 1 1 1 1 1 6 6 6 6 1 6 1 6 1 1 1 6 6 6 6 1 6 1 6 1 1 1 6 6 6 6 1 6 1 6 1 1 1
symmnumber: 1
zpe: 1144685.5 jmol-1
zpe.correction: 0.435988 hartree
zpe.thermalcorrener: 0.460978 hartree
zpe.thermalcorrenthalpy: 0.461922 hartree
zpe.thermalcorrgfe: 0.379764 hartree
zpe.sumelectzpe: -1269.087526 hartree
zpe.sumelectthermal: -1269.062536 hartree
zpe.sumelectthermalent: -1269.061592 hartree
zpe.sumelectthermalfe: -1269.143750 hartree
dipole: 0.0969 -1.0347 -0.0350
dipole: 1.0398
quadrupole: -167.2553 -163.2838 -188.5131
quadrupole: 11.6513 1.7599 -4.8060
quadrupole: 5.7621 9.7336 -15.4957 11.6513 1.7599 -4.8060
hfenergy: -1269.5235142 hartree
pointgroup: C01 [X(C31H22O1)]
dipole: -0.0354506 -0.4073743 0.0118643 debye
polarizability: 512.7799159|-28.1823959|439.4194366|5.3156643|15.1073397|217.7966893 unknown
InChI: InChI=1S/C31H22O/c1-32-25-17-18-26-24(19-25)20-27-28(21-11-5-2-6-12-21)29(22-13-7-3-8-14-22)30(31(26)27)23-15-9-4-10-16-23/h2-20H,1H3
charge 0 multiplicity 1
54 atoms
C  3.38838278 1.35853581 -0.06819664
C  4.75171982 1.05921315 -0.08044671
C  5.19535153 -0.26014303 -0.03162817
C  4.27469729 -1.32057272 0.01888648
C  2.92572854 -1.01228085 0.02560735
C  2.46835182 0.32602331 -0.00985573
C  1.75426561 -1.92399018 0.04309537
C  0.64022685 -1.16507007 0.01172382
C  1.0005466 0.25178904 0.00528085
C  -0.82672219 -1.26075657 0.0021947
C  -1.29639506 0.01844226 -0.01694655
C  -0.13599008 0.98479318 -0.00922194
O  6.54405162 -0.43347336 -0.0415147
C  7.04187164 -1.75314809 0.00394304
H  3.06508906 2.39171093 -0.11383455
H  5.49631779 1.84381633 -0.12880178
H  4.59855765 -2.35275359 0.04720875
H  1.82150797 -3.00429043 0.07217333
H  8.12592534 -1.66664167 -0.0096424
H  6.73025497 -2.26356583 0.92078404
H  6.71348717 -2.33141107 -0.8655537
C  -0.24607829 2.4503249 -0.03389664
C  -1.1289399 3.10179632 -0.90300906
C  0.55636864 3.21883484 0.81667477
C  -1.19246548 4.48924712 -0.92929444
H  -1.75877213 2.51675455 -1.56331593
C  0.48535288 4.6064375 0.79413484
H  1.22235311 2.7141774 1.50849478
C  -0.3881175 5.24528649 -0.08101664
H  -1.87351755 4.98184888 -1.61306747
H  1.10664461 5.1890483 1.46420291
H  -0.44478989 6.32716295 -0.09950431
C  -2.70993276 0.43738187 -0.03201774
C  -3.60541999 -0.11884842 -0.95192557
C  -3.17974384 1.39546868 0.8728228
C  -4.93990443 0.26675227 -0.96010942
H  -3.24469405 -0.85791321 -1.6586023
C  -4.51623813 1.777258 0.86610024
H  -2.49243074 1.83813364 1.58535271
C  -5.39985516 1.21492917 -0.05019573
H  -5.62164495 -0.17165001 -1.67935103
H  -4.86701479 2.51655696 1.57643383
H  -6.44072566 1.51594986 -0.05747417
C  -1.57006728 -2.52808917 0.06102952
C  -1.13062898 -3.62607193 -0.68746128
C  -2.70216117 -2.67770239 0.87124676
C  -1.81107328 -4.8375213 -0.63824474
H  -0.26267643 -3.51602814 -1.32827536
C  -3.37935183 -3.88864696 0.92009375
H  -3.04277015 -1.83940557 1.4678656
C  -2.93845464 -4.97264292 0.16478711
H  -1.4624601 -5.67501361 -1.23118819
H  -4.25161982 -3.98941091 1.55519459
H  -3.46882103 -5.91655171 0.20546396
