program: Gaussian 09
title: 000047628
version: EM64L-G09RevD.01
frameworkgroup: C1[X(C12H15N5O4)]
method: RPBEPBE
basis: SDD
operation: Freq
keyword: #p
keyword: freq=noraman
keyword: PBEPBE/SDD
title: #p freq=noraman PBEPBE/SDD
converged: YES YES NO NO
title: Mulliken charges:
elementType: O O O O N N N N N C C C C C C C C C C C C H H H H H H H H H H H H H H H
charge: -0.242440 -0.125827 -0.231035 -0.190882 -0.095733 -0.386298 -0.061761 0.008366 0.016269 -0.356752 -0.345387 -0.397683 -0.313453 -0.314685 -0.360858 0.419863 -0.104596 -0.352512 -0.030334 0.392496 -0.388328 0.199502 0.215940 0.203860 0.204149 0.232393 0.192842 0.220984 0.196026 0.195097 0.221185 0.245794 0.235990 0.344771 0.262446 0.290591
chargesum: 0.00000
title: Mulliken charges with hydrogens summed into heavy atoms:
elementType: O O O O N N N N N C C C C C C C C C C C C
charge: -0.242440 -0.125827 -0.231035 -0.190882 -0.095733 -0.041527 -0.061761 0.008366 0.016269 0.058690 0.062622 0.027551 0.103557 0.101598 0.120926 0.419863 -0.104596 -0.090065 -0.030334 0.392496 -0.097738
polarizability: 3.13272484e+02 1.61300776e+01 1.90634015e+02 -4.79357119e+00 3.11704977e+00 1.07655601e+02
1716.lowfreq: -17.7085 -4.3049 0.0006 0.0006 0.0007 4.0054 8.8625 23.3746 30.7744
frequency: -11.3559 23.3409 30.6957 61.5277 74.1280 92.6275 114.0515 136.3111 159.9499 177.5543 191.2138 212.0025 239.0902 245.3788 294.6662 325.3737 340.9086 349.1429 383.0955 396.7897 437.1977 462.0272 469.1631 506.2992 511.1944 543.3296 570.1435 573.5779 598.8280 617.6236 637.4489 680.7861 701.9537 705.5320 719.0254 752.7079 785.7301 795.5182 814.0910 832.5619 839.4535 843.0581 899.4010 930.1043 978.4102 992.1870 1001.6354 1024.8878 1030.2494 1051.0646 1057.5334 1068.4267 1089.0736 1105.4474 1124.9251 1141.7205 1155.0027 1162.7730 1190.3794 1215.7917 1228.7176 1256.1648 1263.2278 1271.6231 1288.9301 1295.1568 1297.3400 1319.1633 1333.1507 1333.6902 1346.1624 1350.9948 1361.8672 1371.9680 1388.4007 1397.9202 1443.2646 1446.9390 1449.6126 1452.9220 1458.6540 1475.0983 1483.7073 1489.0229 1516.2509 1589.2093 1603.2527 2843.8707 2875.7690 2884.9986 2957.6339 2961.6986 2968.4619 3019.7168 3030.5577 3034.7305 3041.2484 3085.8020 3088.9276 3164.7964 3182.9637 3517.4805
redmass: 3.3308 5.4979 6.2001 10.0548 5.7929 5.2181 4.0624 2.7306 6.8377 8.5784 7.0231 4.0551 1.8756 5.3932 3.3265 2.7819 5.0158 7.6656 2.7225 3.4078 5.7863 5.7017 2.9000 2.9738 6.3813 1.4460 7.1683 7.8394 1.9999 5.8936 8.1568 8.8180 7.4170 9.1824 7.0003 4.7606 3.8365 1.5275 2.8341 1.4377 1.5797 13.7262 2.2927 11.7160 1.3329 7.5959 2.8396 2.2589 3.8467 2.5064 2.0583 2.2657 3.5229 2.2631 2.1840 2.4347 2.1636 3.4797 1.0660 1.2124 4.9837 1.3780 1.6815 1.3043 2.4858 1.3216 1.4210 1.5979 2.3805 1.4726 1.6660 3.1886 1.5014 1.2680 2.1959 1.8263 1.0818 1.0796 1.1138 3.1480 1.1501 1.0989 1.6258 1.6250 4.3976 5.0640 7.3283 1.0704 1.0701 1.0686 1.0668 1.0667 1.0614 1.0910 1.0904 1.0910 1.0976 1.0961 1.0980 1.0886 1.0946 1.0774
irintensity: 0.4153 3.8631 2.7386 0.1715 0.3946 0.2269 0.2099 1.1256 0.3358 2.5028 0.4429 1.2617 2.1339 0.5089 17.6076 3.9725 2.0548 0.4151 0.8265 0.6268 10.5097 1.6156 1.3115 24.6643 4.0526 70.3731 0.7956 20.0995 11.5255 0.4675 6.0624 11.3865 1.6872 0.0314 34.1560 3.5701 1.6436 15.2047 13.7524 33.3401 0.2746 18.3104 11.5380 13.3585 2.4368 24.7369 24.0538 13.2571 0.4038 22.3718 0.5448 12.6484 58.6515 6.0490 51.1281 106.1734 9.3140 61.2836 1.5472 3.6923 578.7512 28.7581 19.9460 3.5448 5.8419 3.6625 11.0708 17.8437 67.7504 27.3138 36.5295 64.1887 1.1107 2.9606 1.8059 4.9085 3.3627 0.8851 27.3003 122.3254 3.2476 24.7713 54.0128 7.6234 16.4014 491.6085 280.4591 71.0792 46.4053 134.2763 26.0270 96.6901 31.8459 4.9994 31.9607 40.8923 57.0027 34.8463 34.0590 2.7534 8.8164 123.9566
temp: 298.150 k
press: 1.00000 atm
elementType: 8 8 8 8 7 7 7 7 7 6 6 6 6 6 6 6 6 6 6 6 6 1 1 1 1 1 1 1 1 1 1 1 1 1 1 1
symmnumber: 1
zpe: 721558.6 jmol-1
zpe.correction: 0.274827 hartree
zpe.thermalcorrener: 0.292628 hartree
zpe.thermalcorrenthalpy: 0.293572 hartree
zpe.thermalcorrgfe: 0.227513 hartree
zpe.sumelectzpe: -1039.168955 hartree
zpe.sumelectthermal: -1039.151155 hartree
zpe.sumelectthermalent: -1039.150210 hartree
zpe.sumelectthermalfe: -1039.216269 hartree
dipole: 10.0460 -0.0672 -0.6701
dipole: 10.0685
quadrupole: -192.0174 -130.9330 -117.9226
quadrupole: 1.3583 -3.9810 -3.1754
quadrupole: -45.0597 16.0247 29.0350 1.3583 -3.9810 -3.1754
hfenergy: -1039.4437825 hartree
pointgroup: C01 [X(C12H15N5O4)]
dipole: 3.9556611 0.0374627 -0.2072581 debye
polarizability: 313.2154017|16.6899774|185.4469695|1.6233245|20.6549844|112.8997294 unknown
InChI: InChI=1S/C12H15N5O4/c18-17(19)10-2-1-9(11-12(10)15-21-14-11)13-3-4-16-5-7-20-8-6-16/h1-2,13H,3-8H2
charge 0 multiplicity 1
36 atoms
O  6.923489 -0.66105 0.315783
O  -3.285138 2.661737 0.83565
O  -5.01611 -2.569704 -0.855336
O  -5.896481 -0.565782 -0.176018
N  4.164962 0.110947 -0.156114
N  0.448008 0.697547 0.113609
N  -1.908787 2.297564 0.687863
N  -4.185951 1.560774 0.491613
N  -4.897072 -1.340685 -0.451067
C  5.294334 0.903639 -0.714317
C  4.576542 -0.553266 1.110798
C  2.911253 0.878745 -0.033795
C  6.508669 -0.012914 -0.939091
C  5.804267 -1.444938 0.860473
C  1.684698 -0.052263 -0.150232
C  -0.808963 0.174561 -0.030761
C  -1.954061 1.01315 0.2659
C  -1.098923 -1.143593 -0.455329
C  -3.329949 0.553197 0.142724
C  -3.5552 -0.795403 -0.296976
C  -2.439092 -1.5984 -0.58047
H  5.590315 1.737909 -0.031222
H  4.983394 1.342501 -1.681021
H  3.747222 -1.177524 1.49226
H  4.826889 0.20261 1.896469
H  2.871528 1.620737 -0.853304
H  2.855334 1.451202 0.928794
H  7.384211 0.56468 -1.277563
H  6.254603 -0.786379 -1.69539
H  5.535204 -2.259276 0.153864
H  6.17757 -1.878512 1.802527
H  1.660842 -0.484291 -1.168608
H  1.774141 -0.895381 0.564332
H  0.521693 1.661036 0.452251
H  -0.285037 -1.832829 -0.691883
H  -2.638305 -2.622244 -0.912414
