program: Gaussian 09
title: 000002391
version: EM64L-G09RevD.01
frameworkgroup: C1[X(C22H19NO4)]
method: RPBEPBE
basis: SDD
operation: Freq
keyword: #p
keyword: freq=noraman
keyword: PBEPBE/SDD
title: #p freq=noraman PBEPBE/SDD
converged: YES YES NO NO
title: Mulliken charges:
elementType: O O O O N C C C C C C C C C C C C C C C C C C C C C C H H H H H H H H H H H H H H H H H H H
charge: -0.281254 -0.280413 -0.227920 -0.230654 -0.056637 -0.532311 0.499910 0.513792 0.230904 -0.417870 -0.446165 -0.360616 -0.295163 -0.342504 -0.405763 -0.331101 -0.348191 -0.422111 0.350573 0.356293 -0.182960 -0.368893 -0.178387 0.257259 0.257083 -0.750538 -0.750599 0.202329 0.230468 0.223507 0.280925 0.256452 0.235416 0.252542 0.299781 0.298687 0.252246 0.238843 0.241398 0.233278 0.251359 0.245912 0.252080 0.251840 0.245213 0.251957
chargesum: 0.00000
title: Mulliken charges with hydrogens summed into heavy atoms:
elementType: O O O O N C C C C C C C C C C C C C C C C C C C C C C
charge: -0.281254 -0.280413 -0.227920 -0.230654 -0.056637 -0.329982 0.499910 0.513792 0.230904 -0.187402 -0.222658 -0.079691 -0.038712 -0.107088 -0.153220 -0.031319 -0.049504 -0.169865 0.350573 0.356293 0.055884 -0.127495 0.054891 0.257259 0.257083 -0.001188 -0.001588
polarizability: 3.16525028e+02 -1.69337772e+00 2.53065719e+02 -1.41029627e+01 -1.89856441e-01 2.30509466e+02
1716.lowfreq: -4.5046 -0.0011 -0.0008 -0.0007 3.1391 6.0874 13.7458 22.9957 26.4839
frequency: 13.4912 22.9642 26.4492 31.1385 40.9488 47.5270 51.1991 65.5674 66.6612 71.2247 78.3646 83.3740 119.0318 143.4271 163.3411 180.0540 209.4885 217.1147 253.2500 256.9850 312.5839 340.5568 354.7861 356.0417 363.7336 388.4081 404.1981 411.3671 413.4804 476.0534 509.7944 511.4729 546.4270 550.4426 555.9462 556.9816 606.4223 620.2203 621.7636 644.6531 651.7031 676.6010 718.1124 733.5392 734.5554 749.2821 751.7344 782.8172 813.7359 823.5156 834.1646 835.3198 856.7718 874.0927 887.0401 889.2215 891.0233 901.1327 954.8704 959.0197 960.0457 967.1146 971.3526 994.6397 995.5463 999.4010 1004.4311 1009.4445 1010.6025 1039.3441 1039.4791 1042.4779 1088.8825 1111.0621 1119.3400 1147.9421 1151.7201 1166.0099 1174.5862 1180.3002 1185.7765 1190.1276 1197.4093 1202.5919 1204.5561 1248.2591 1254.6273 1302.6831 1307.4285 1312.5737 1340.9510 1380.9350 1382.4716 1383.1181 1386.1684 1411.8069 1413.4301 1419.1236 1451.7896 1452.1797 1452.4569 1453.7975 1454.2607 1483.9367 1487.6778 1565.8809 1578.1993 1582.8123 1586.4565 1610.9166 1615.0566 1654.3290 1655.9379 3003.7363 3007.8731 3008.2390 3096.2478 3096.5315 3120.6963 3125.1711 3126.6722 3135.7087 3143.9895 3144.2681 3144.7742 3152.0103 3157.8718 3166.3994 3171.4021 3182.3934 3208.3228 3208.8612
redmass: 6.7996 7.8838 4.3016 4.6403 4.7842 3.3456 4.0967 1.8439 3.2120 2.0741 1.7007 1.9669 6.0261 5.4645 6.0524 6.3707 4.9507 5.6492 5.8106 6.2811 4.4804 4.8078 4.9353 5.2918 4.9071 5.0067 3.4730 2.9781 3.0549 3.9450 3.0648 3.8428 3.3215 3.4045 3.1306 3.1529 6.1485 6.6940 6.9635 5.4431 5.5625 6.4976 4.6104 4.9745 4.3068 1.5623 5.1316 3.0457 3.1854 1.7757 1.3923 1.8937 2.0581 1.9723 3.4251 6.4903 3.3545 1.4530 1.4000 1.4586 1.3889 5.2669 1.4120 1.9257 1.9229 1.3439 1.3227 2.8395 2.8467 1.6392 1.6390 2.4004 1.6675 1.3583 1.3403 2.3298 2.3538 1.1283 3.1166 3.5998 3.4143 1.5838 1.4937 2.0521 1.5605 1.6235 2.8079 2.3258 1.4898 1.3671 1.9830 2.3972 1.4390 1.4457 4.0995 2.7752 2.6639 2.1434 1.0663 1.9902 1.0893 1.0473 1.0470 2.4403 2.4595 5.7199 5.7968 7.1294 7.1011 6.5059 6.4434 9.5696 9.6142 1.0837 1.0367 1.0367 1.0974 1.0974 1.0907 1.0896 1.0882 1.0890 1.1011 1.1010 1.0914 1.0947 1.0889 1.0953 1.1015 1.0957 1.0939 1.0941
irintensity: 0.4430 0.7643 2.6699 4.8752 1.7753 0.9073 0.8474 1.2735 0.9091 0.6871 0.6216 0.5489 0.6174 0.7976 4.3449 1.3919 5.6803 0.9719 0.6478 4.1576 0.7605 0.7161 4.2383 0.9794 1.4442 3.6161 8.5588 1.0286 0.4117 12.6822 8.5720 13.3338 5.4830 10.3806 0.0429 0.5792 13.4163 4.8437 0.4193 27.7116 32.4329 0.9936 3.8282 13.4514 8.2693 36.9194 4.8783 8.3767 23.7148 46.8395 11.1071 8.3925 4.8142 10.7741 64.1392 32.9678 35.5789 1.2342 2.7560 0.0859 0.9695 1.7520 2.8448 136.3628 56.0311 0.0231 2.3628 61.2441 31.6780 8.4512 9.2821 4.9954 2.8378 0.0346 30.9041 417.2713 117.1970 1.4992 24.1854 665.4712 189.0362 7.1278 15.2224 143.6269 19.6397 1.6694 5.0579 5.8102 5.3815 4.4707 3.0494 10.6610 39.7149 70.5915 14.7119 24.1341 4.8743 9.0903 21.3797 46.4524 27.1083 18.9380 18.8936 209.2853 77.4909 10.2880 43.3822 15.4609 3.2290 5.3283 2.6927 247.5062 154.6325 15.9310 2.0096 1.9968 7.0636 7.0407 12.5918 14.4697 16.0280 2.6428 12.5142 10.3924 1.9135 23.7093 5.7846 7.2793 26.9345 2.7933 2.1042 2.9087
temp: 298.150 k
press: 1.00000 atm
elementType: 8 8 8 8 7 6 6 6 6 6 6 6 6 6 6 6 6 6 6 6 6 6 6 6 6 6 6 1 1 1 1 1 1 1 1 1 1 1 1 1 1 1 1 1 1 1
symmnumber: 1
zpe: 928241.2 jmol-1
zpe.correction: 0.353548 hartree
zpe.thermalcorrener: 0.378523 hartree
zpe.thermalcorrenthalpy: 0.379467 hartree
zpe.thermalcorrgfe: 0.293429 hartree
zpe.sumelectzpe: -1203.493950 hartree
zpe.sumelectthermal: -1203.468975 hartree
zpe.sumelectthermalent: -1203.468031 hartree
zpe.sumelectthermalfe: -1203.554069 hartree
dipole: 0.6451 1.3379 0.9198
dipole: 1.7470
quadrupole: -154.2106 -129.0660 -149.6297
quadrupole: -3.5586 19.8455 3.4043
quadrupole: -9.9085 15.2361 -5.3276 -3.5586 19.8455 3.4043
hfenergy: -1203.8474983 hartree
pointgroup: C01 [X(C22H19N1O4)]
dipole: 0.2419037 0.5686882 0.3008339 debye
polarizability: 314.1132636|0.9222188|252.781243|-19.988334|-2.9488108|233.2057064 unknown
InChI: InChI=1S/C22H19NO4/c1-15(24)26-19-10-6-17(7-11-19)22(21-5-3-4-14-23-21)18-8-12-20(13-9-18)27-16(2)25/h3-14,22H,1-2H3
charge 0 multiplicity 1
46 atoms
O  4.995093 -1.657788 0.272879
O  -4.549237 -2.263783 -0.329899
O  5.611616 -1.395997 -1.988538
O  -5.883534 -2.144588 1.610959
N  -0.263325 2.474368 -1.299955
C  -0.030394 1.181733 0.817643
C  1.318923 0.472939 0.596928
C  -1.231983 0.26197 0.531145
C  -0.149224 2.514472 0.064799
C  1.935669 -0.178374 1.697031
C  -2.235799 0.094852 1.513907
C  1.960313 0.409332 -0.664073
C  -1.376052 -0.421987 -0.703604
C  -0.150516 3.741825 0.775243
C  3.15091 -0.871593 1.542997
C  -3.366863 -0.726922 1.301049
C  3.183292 -0.276722 -0.842158
C  -2.492783 -1.244141 -0.939555
C  3.768704 -0.917722 0.273668
C  -3.480603 -1.393107 0.060182
C  -0.280802 4.955721 0.065079
C  -0.385402 3.651309 -1.975539
C  -0.404635 4.914429 -1.341832
C  5.829964 -1.851323 -0.847375
C  -5.67268 -2.580248 0.460212
C  7.014596 -2.695882 -0.430713
C  -6.564899 -3.522813 -0.318188
H  -0.081185 1.434156 1.89413
H  1.457043 -0.150277 2.683363
H  -2.143139 0.616217 2.474977
H  1.501871 0.91564 -1.51972
H  -0.618322 -0.303125 -1.481689
H  -0.051886 3.741521 1.865958
H  3.631722 -1.377158 2.385837
H  -4.129705 -0.845151 2.070441
H  3.665699 -0.311287 -1.819101
H  -2.615944 -1.776616 -1.88744
H  -0.287061 5.912254 0.598552
H  -0.472231 3.569987 -3.0654
H  -0.511558 5.828744 -1.933578
H  7.551863 -2.214514 0.404355
H  7.691667 -2.826643 -1.286818
H  6.669743 -3.682064 -0.073942
H  -6.902908 -3.040325 -1.25175
H  -7.435033 -3.796626 0.295358
H  -6.004688 -4.430092 -0.602628
