program: Gaussian 16
title: Ru2_ethene_MCB_SP, SP BENZENE
version: ES64L-G16RevC.01
method: RPBEPBE
basis: GenECP
operation: SP
keyword: #P
keyword: #
keyword: PBEPBE/GENECP
keyword: 5D
keyword: 7F
keyword: IOp(3/174=1000000,3/175=358940,3/177=12092,3/178=5938951)
keyword: GEOM=CHECK
keyword: GUESS=READ
keyword: GFINPUT
keyword: NOSYMM
keyword: INT=ULTRAFINE
keyword: EMPIRICALDISPERSION=GD3BJ
keyword: SCRF=(PCM,SOLVENT=Benzene,READ)
keyword: #SCF=(VSHIFT=800,NOVARACC,MAXCYCLE=180,CONVER=5)
keyword: SP
title: #P # PBEPBE/GENECP 5D 7F # IOp(3/174=1000000,3/175=358940,3/177=12092,
basis: NPDir=0 NMtPBC= 1 NCelOv= 1 NCel= 1 NClECP= 1 NCelD= 1
basis: NCelK= 1 NCelE2= 1 NClLst= 1 CellRange= 0.0.
basis: One-electron integrals computed using PRISM.
title: Mulliken charges:
elementType: C Ru C H C C Cl Cl H H N N C C C C H C H C C C H H H H H H H H H C C C H H H H H H H H H C C C C H H H C H C C H H H H C H H H C C C C C H H H C H C C H H H H C H H H H H H
charge: 0.049658 -0.741574 -0.136814 0.088230 0.049404 1.020089 -0.535214 -0.534296 0.099476 0.088375 -0.096865 -0.092825 0.072121 -0.297997 0.074711 0.260401 0.119711 0.259950 0.117240 -0.308772 -0.331775 -0.266036 0.056991 0.060605 0.091829 0.070281 0.061175 0.118148 0.060219 0.079677 0.061322 -0.309341 -0.331145 -0.266016 0.060788 0.091648 0.057173 0.070317 0.061283 0.118090 0.061260 0.060173 0.079613 0.116309 0.086766 -0.255880 -0.130788 0.145072 0.073472 0.080163 0.161846 0.056581 -0.341379 -0.105413 0.118598 0.110139 0.103535 0.071672 -0.280990 0.077848 0.110916 0.084052 -0.301174 0.118430 0.087943 -0.259268 -0.132006 0.080368 0.147107 0.073369 0.163501 0.056419 -0.341382 -0.106008 0.118794 0.110030 0.103454 0.071791 -0.282274 0.077264 0.111073 0.084519 0.132468 0.099332 0.132441
chargesum: -0.00000
dipole: -0.5920 -4.3939 -0.2064
dipole: 4.4384
quadrupole: -257.3307 -247.6624 -250.8429
quadrupole: -0.1173 15.8090 -2.1303
quadrupole: -5.3853 4.2829 1.1024 -0.1173 15.8090 -2.1303
hfenergy: -2371.5188784 hartree
pointgroup: C01 [X(C32H48Cl2N2Ru1)]
dipole: -0.2329079 -1.7286942 -0.0812017 debye
InChI: InChI=1S/C29H42N2.C3H6.2ClH.Ru/c1-18-13-20(3)24(21(4)14-18)30-17-31(25-22(5)15-19(2)16-23(25)6)27(29(10,11)12)26(30)28(7,8)9;1-3-2;;;/h13-16,26-27H,1-12H3;1-3H2;2*1H;/q;;;;+2/p-2
charge 0 multiplicity 1
85 atoms
C  -0.406072 3.644809 -0.671986
Ru 0.4274 2.062492 0.128221
C  0.725117 4.292664 0.223213
H  -1.424151 3.870864 -0.306802
C  1.636736 3.29877 1.049014
C  0.166454 0.087738 0.041249
Cl 1.9248 2.011507 -1.743588
Cl -1.0498 2.248035 2.006617
H  1.493957 3.375398 2.141205
H  2.682716 3.280468 0.693369
N  -0.59544 -0.545702 -0.878843
N  0.72998 -0.799288 0.892204
C  -0.610348 -2.028308 -0.667336
C  -1.084212 0.179002 -2.035319
C  0.368585 -2.211383 0.547057
C  -2.056236 -2.614012 -0.503743
H  -0.169675 -2.507334 -1.565995
C  1.619381 -3.128707 0.31359
H  -0.190049 -2.641858 1.403815
C  2.486981 -2.62775 -0.851366
C  2.44983 -3.1957 1.612304
C  1.182712 -4.569343 -0.004737
H  2.011302 -2.834708 -1.829071
H  3.464051 -3.151676 -0.847378
H  2.6822 -1.543293 -0.78844
H  3.234557 -3.972203 1.508948
H  1.815598 -3.471597 2.480196
H  2.948338 -2.242676 1.856669
H  0.594035 -5.018654 0.819733
H  2.087811 -5.19385 -0.145805
H  0.589549 -4.63646 -0.93594
C  -2.78128 -2.018538 0.712894
C  -2.861761 -2.347183 -1.792528
C  -2.004773 -4.1414 -0.324888
H  -3.858909 -2.276169 0.673688
H  -2.695832 -0.918881 0.751319
H  -2.383764 -2.427029 1.661618
H  -3.819351 -2.904584 -1.751091
H  -2.309007 -2.693997 -2.690179
H  -3.098353 -1.280252 -1.941716
H  -1.45824 -4.442951 0.588208
H  -1.541316 -4.648019 -1.194761
H  -3.040664 -4.524841 -0.229904
C  -2.188965 1.059258 -1.912213
C  -0.403316 0.043354 -3.272774
C  -3.020712 1.207367 -0.664463
C  -2.575527 1.800043 -3.047346
H  -2.434859 1.167186 0.271639
H  -3.80357 0.420469 -0.622506
H  -3.544407 2.182031 -0.673876
C  -1.930433 1.681293 -4.284506
H  -3.426498 2.491916 -2.94846
C  -2.356392 2.497292 -5.47800402
C  -0.850607 0.786685 -4.373519
H  -1.562674 3.216382 -5.770364
H  -3.276587 3.075762 -5.269759
H  -2.546994 1.853298 -6.36085999
H  -0.308222 0.685373 -5.32637702
C  0.809183 -0.831262 -3.424172
H  0.553584 -1.912057 -3.406831
H  1.532593 -0.627224 -2.613349
H  1.314002 -0.626695 -4.386202
C  1.370389 -0.330862 2.105681
C  2.666539 0.241696 2.054708
C  0.657112 -0.395138 3.330643
C  3.528699 0.282238 0.819438
C  3.212411 0.752886 3.249476
H  4.290831 1.078339 0.918008
H  2.968925 0.486665 -0.111369
H  4.076946 -0.675691 0.694914
C  2.538297 0.695137 4.475428
H  4.214618 1.207216 3.207452
C  3.140785 1.263382 5.73471503
C  1.26276 0.106071 4.490901
H  2.556079 2.135493 6.09540401
H  4.183082 1.598616 5.573515
H  3.142259 0.51658 6.55493102
H  0.696876 0.063996 5.434492
C  -0.742667 -0.93556 3.410707
H  -0.776263 -2.038641 3.285583
H  -1.37698 -0.473676 2.631685
H  -1.190727 -0.700836 4.393742
H  1.396911 4.834402 -0.467048
H  -0.236944 3.773169 -1.755499
H  0.211556 4.932724 0.963404
