program: Gaussian 09
title: 000047616
version: EM64L-G09RevD.01
frameworkgroup: C1[X(C13H17NO2)]
method: RPBEPBE
basis: SDD
operation: Freq
keyword: #p
keyword: freq=noraman
keyword: PBEPBE/SDD
title: #p freq=noraman PBEPBE/SDD
converged: YES YES NO NO
title: Mulliken charges:
elementType: O O N C C C C C C C C C C C C C H H H H H H H H H H H H H H H H H
charge: -0.282334 -0.326687 -0.684886 -0.478537 -0.243911 -0.157175 0.062497 -0.440330 -0.158396 0.325871 0.240283 -0.315819 -0.396431 -0.669632 -0.268151 -0.195534 0.198845 0.221787 0.230782 0.223762 0.221033 0.207037 0.202417 0.218135 0.269906 0.217863 0.214963 0.227871 0.209001 0.228323 0.223641 0.374183 0.299624
chargesum: 0.00000
title: Mulliken charges with hydrogens summed into heavy atoms:
elementType: O O N C C C C C C C C C C C C C
charge: -0.282334 -0.326687 -0.011080 -0.057904 0.210633 0.063858 0.062497 -0.030877 0.059739 0.325871 0.240283 -0.045913 -0.178567 -0.017796 -0.039829 0.028107
polarizability: 1.89020964e+02 -3.53403956e+00 1.89826168e+02 -1.46410750e+01 -1.47484344e+01 9.74859165e+01
1716.lowfreq: -6.4429 -2.7512 -0.0006 0.0006 0.0006 6.5221 13.8125 16.2317 37.0397
frequency: 13.6812 16.2105 36.9955 75.0729 82.6741 108.9029 117.1077 146.4534 180.9274 188.3813 235.2372 248.5440 275.3068 284.1613 353.9973 398.2698 410.1694 426.2047 458.6641 465.5531 472.3308 491.5953 525.4057 554.6246 655.6147 677.5910 727.6238 758.7318 766.5656 775.5596 779.7312 787.5114 823.2666 854.3915 864.0382 889.3674 901.6318 962.9228 967.2363 974.3488 983.2116 1019.0215 1020.8395 1041.6179 1053.0634 1065.5000 1067.1200 1108.6069 1145.4645 1153.0338 1174.6092 1198.8706 1226.0443 1242.5446 1257.2536 1277.5337 1288.3216 1292.8775 1316.2291 1330.9623 1353.6129 1363.1916 1385.1476 1403.0500 1443.8382 1445.8876 1464.5564 1472.2634 1474.7377 1485.0984 1486.2759 1535.9404 1578.1994 1618.3751 1634.4894 1691.7404 2964.5657 2965.1610 2976.5225 3002.1434 3025.6310 3041.4023 3063.7294 3067.6574 3072.9681 3077.2772 3082.4350 3118.7838 3139.5280 3156.0065 3176.2806 3401.9910 3648.7168
redmass: 4.4637 4.0314 2.5333 4.0240 3.5362 3.0551 4.8806 3.3593 2.0852 2.6126 1.5824 3.2018 2.4689 4.8307 4.0877 2.4612 5.6030 2.6256 3.0517 1.2851 2.7504 2.7932 3.1140 6.6466 6.5781 4.4760 1.2742 1.6864 1.2781 3.0247 2.0307 2.3955 2.7688 1.5160 3.1237 1.8382 2.1455 1.3614 1.4013 1.7333 1.3249 2.1601 2.0707 2.3306 2.1678 2.8438 1.8483 2.2001 1.8883 1.3062 1.0571 1.3465 1.1925 1.2116 2.7592 1.2386 1.8405 1.2920 1.4012 1.9574 1.4882 1.5262 1.2029 5.9297 3.0078 1.0949 1.0756 1.0857 1.0436 1.1014 2.3542 3.9468 7.0552 1.4711 7.1511 6.6116 1.0619 1.0639 1.0355 1.0582 1.0970 1.0948 1.0956 1.1021 1.0997 1.0921 1.1002 1.0863 1.0916 1.0931 1.0984 1.0561 1.0945
irintensity: 0.0416 0.0701 0.3646 2.4381 1.3002 0.1988 1.1936 0.2881 4.0977 0.9979 1.3490 0.9266 0.4869 9.2255 3.8712 2.2317 0.9484 28.5744 15.5312 109.9679 12.5440 1.7633 22.8738 1.9100 6.9251 16.4139 96.1602 122.6028 5.4228 7.1430 2.6347 1.6667 2.0453 1.9232 8.7323 5.8191 6.0681 2.1187 46.0156 31.1330 0.0085 0.6651 12.7180 42.8868 46.4925 265.0112 19.0975 10.4621 2.9538 12.0224 31.5376 3.2409 8.7205 11.6170 460.3683 4.2022 12.0602 5.8447 0.8621 10.1191 3.9490 14.8154 8.6258 8.6406 3.1560 16.6759 7.6316 12.4286 10.3685 22.3969 31.5938 255.6952 97.3192 115.9105 212.5948 0.4361 40.2084 39.8176 31.2942 35.2623 9.5830 9.8247 2.3050 14.1878 6.0853 123.7722 63.9878 8.2990 23.5036 15.8320 12.9549 106.7238 55.4792
temp: 298.150 k
press: 1.00000 atm
elementType: 8 8 7 6 6 6 6 6 6 6 6 6 6 6 6 6 1 1 1 1 1 1 1 1 1 1 1 1 1 1 1 1 1
symmnumber: 1
zpe: 716638.1 jmol-1
zpe.correction: 0.272953 hartree
zpe.thermalcorrener: 0.289511 hartree
zpe.thermalcorrenthalpy: 0.290455 hartree
zpe.thermalcorrgfe: 0.225879 hartree
zpe.sumelectzpe: -709.587328 hartree
zpe.sumelectthermal: -709.570770 hartree
zpe.sumelectthermalent: -709.569826 hartree
zpe.sumelectthermalfe: -709.634402 hartree
dipole: -0.2013 0.4259 0.0837
dipole: 0.4785
quadrupole: -78.5157 -91.3403 -96.5173
quadrupole: -2.1837 -3.7118 -0.9325
quadrupole: 10.2754 -2.5492 -7.7262 -2.1837 -3.7118 -0.9325
hfenergy: -709.8602812 hartree
pointgroup: C01 [X(C13H17N1O2)]
dipole: -0.087989 0.1626206 0.0353197 debye
polarizability: 189.7976502|-3.0173687|190.1456695|-12.4782107|-13.3418983|96.3897289 unknown
InChI: InChI=1S/C13H17NO2/c1-2-3-4-7-10-16-13(15)11-8-5-6-9-12(11)14/h3-6,8-9H,2,7,10,14H2,1H3
charge 0 multiplicity 1
33 atoms
O  0.506182 -1.123603 -0.449648
O  -1.199979 -2.48707 0.346487
N  -3.635075 -1.392784 0.611798
C  2.81398 -1.814623 -0.781423
C  1.422578 -2.290872 -0.342802
C  3.420389 -0.781286 0.146314
C  -1.658458 -0.140542 -0.162149
C  4.432235 1.498256 0.689198
C  3.84366 0.451282 -0.233694
C  -3.06053 -0.214791 0.179081
C  -0.814507 -1.341504 -0.0556
C  -1.107296 1.099479 -0.597569
C  -3.850623 0.973032 0.056596
C  3.59066 2.801463 0.710104
C  -1.898106 2.25259 -0.708456
C  -3.279903 2.177012 -0.378022
H  3.459986 -2.71782 -0.817876
H  2.756551 -1.416969 -1.811673
H  1.039801 -3.1003 -0.991162
H  1.41483 -2.653293 0.702097
H  3.507512 -1.072729 1.205805
H  4.51368 1.089163 1.714569
H  5.463169 1.747113 0.361734
H  3.737767 0.744539 -1.291347
H  -0.04149 1.125679 -0.842377
H  -4.916658 0.927527 0.310913
H  4.050947 3.560933 1.368677
H  2.56727 2.599909 1.074456
H  3.50931 3.235921 -0.303996
H  -1.459562 3.197428 -1.04364
H  -3.910288 3.070152 -0.461165
H  -3.031926 -2.220265 0.693774
H  -4.623708 -1.426826 0.845695
