program: Gaussian 09
title: 000047610
version: EM64L-G09RevD.01
frameworkgroup: C1[X(C16H16O6)]
method: RPBEPBE
basis: SDD
operation: Freq
keyword: #pfreq=noraman
keyword: PBEPBE/SDD
title: #p freq=noraman PBEPBE/SDD
converged: YES YES NO NO
title: Mulliken charges:
elementType: O O O O O O C C C C C C C C C C C C C C C C H H H H H H H H H H H H H H H H
charge: -0.291244 -0.288768 -0.441856 -0.432996 -0.495598 -0.433403 -0.034561 -0.213838 -0.531808 0.221200 0.239804 0.516963 0.172747 -0.579500 -0.551309 -0.397968 -0.617630 0.371718 -0.510219 0.175166 -0.315659 0.133565 0.222938 0.235288 0.246982 0.239643 0.278960 0.238698 0.262251 0.213934 0.213984 0.208568 0.232234 0.248066 0.358480 0.351952 0.371394 0.381824
chargesum: 0.00000
title: Mulliken charges with hydrogens summed into heavy atoms:
elementType: O O O O O O C C C C C C C C C C C C C C C C
charge: -0.291244 -0.288768 -0.083376 -0.081044 -0.124204 -0.051579 0.188377 0.021450 -0.045183 0.221200 0.239804 0.516963 0.172747 -0.300539 -0.312611 -0.135717 -0.403696 0.371718 0.144566 0.175166 -0.067594 0.133565
polarizability: 2.88039627e+02 5.46143148e+00 1.90651830e+02 4.54205067e+00 1.70121975e+01 1.18349642e+02
1716.lowfreq: -8.6576 -3.4307 -0.0008 -0.0005 0.0002 5.7219 17.7860 28.2044 38.5717
frequency: 17.6568 28.1985 38.4963 49.7822 62.7927 123.0386 148.9367 159.3493 172.0186 196.7552 210.5907 215.8862 231.1261 242.9578 252.6496 264.6587 279.8596 302.6066 308.1449 315.7132 337.3357 349.3286 371.7938 405.8167 429.5636 447.6371 458.6210 484.2488 487.5173 509.0068 526.7637 559.2225 568.7318 585.6315 605.3707 606.6691 627.2730 653.7869 694.5800 715.1774 758.1745 762.4084 769.1853 792.8279 825.8568 841.9374 846.9623 861.5413 907.0330 937.6327 948.3222 954.7505 986.0279 1021.0894 1033.6988 1064.4671 1073.3767 1098.4666 1105.2703 1113.9437 1130.9623 1157.1020 1160.9763 1166.9496 1173.5457 1181.5025 1184.5668 1204.4300 1215.8765 1228.6731 1264.1337 1282.0127 1286.4707 1292.0168 1325.7708 1333.8233 1345.6204 1356.7187 1405.8120 1416.6167 1431.2122 1436.2287 1442.9888 1458.7154 1466.8973 1476.5809 1517.6094 1523.0226 1601.2746 1618.0541 1628.7994 1644.5775 2939.5384 2950.3653 2976.0546 2983.9657 3019.4922 3049.3725 3102.8528 3110.7186 3127.4685 3158.8585 3179.2963 3193.5143 3525.6116 3587.5969 3588.3264 3622.7473
redmass: 5.0600 6.2088 3.3915 5.9726 3.5635 4.0635 4.7206 1.9708 5.5257 3.2595 6.1484 3.2751 3.3573 4.8134 2.6890 1.3708 5.1127 4.7185 2.7282 1.1208 5.1486 1.3380 5.4944 4.7770 3.3609 3.8865 3.4463 1.1478 4.9881 5.2279 6.4269 6.7885 7.0409 3.5518 3.7084 4.5631 4.5060 6.8909 2.6631 3.4822 5.8630 1.9778 3.4296 3.9072 1.4182 1.6439 1.5973 2.8422 6.2963 3.2212 1.8023 2.3175 5.0757 3.9236 3.2660 5.1489 2.3844 2.7534 1.8872 1.2701 1.2795 1.3813 1.2619 1.4875 1.2338 1.5028 1.5980 1.8944 1.5187 2.4175 1.3047 1.7835 1.6946 1.4121 1.4963 4.2997 1.5188 1.9810 6.0659 3.9740 4.2261 1.1889 2.9268 1.0737 1.1401 1.0528 3.4088 3.3185 7.5223 6.6372 7.1693 7.3076 1.0344 1.0814 1.0772 1.0720 1.1031 1.0964 1.0984 1.0915 1.0918 1.0881 1.0966 1.0928 1.0648 1.0661 1.0660 1.0665
irintensity: 1.7536 2.9822 1.2215 0.7089 1.8753 0.1050 2.7644 0.7943 2.3168 3.3693 0.6366 0.1571 5.3727 1.7209 49.4891 122.6873 6.4669 6.4134 26.8573 154.6837 6.1858 70.2962 11.5568 16.8979 7.5601 28.3871 2.7218 112.6878 7.5108 13.5806 3.7530 1.3831 27.6065 19.3603 24.9066 13.5137 4.9934 8.8313 7.3096 3.0546 34.6928 41.8605 13.1309 2.7206 25.1158 38.5380 39.2255 5.9566 24.8095 5.6146 12.8670 27.4509 68.6752 273.6465 52.3003 137.2399 104.5933 147.4574 291.9494 5.2050 20.5971 26.9487 10.0299 6.0740 30.3669 126.8914 108.4094 6.9692 115.9158 83.3559 1.1225 16.2800 117.5132 38.1049 12.4396 0.8135 10.2083 7.7702 32.7563 52.1966 130.6365 3.5054 46.1265 18.1579 6.1649 15.6301 69.5222 84.0493 158.2892 23.1626 16.6156 227.0217 67.7458 15.2840 12.1562 45.5336 61.9008 14.7663 28.6042 14.6860 8.1417 5.3059 4.1345 0.2371 90.7380 34.2438 37.0708 48.0287
temp: 298.150 k
press: 1.00000 atm
elementType: 8 8 8 8 8 8 6 6 6 6 6 6 6 6 6 6 6 6 6 6 6 6 1 1 1 1 1 1 1 1 1 1 1 1 1 1 1 1
symmnumber: 1
zpe: 760966.0 jmol-1
zpe.correction: 0.289837 hartree
zpe.thermalcorrener: 0.310604 hartree
zpe.thermalcorrenthalpy: 0.311548 hartree
zpe.thermalcorrgfe: 0.239537 hartree
zpe.sumelectzpe: -1069.002754 hartree
zpe.sumelectthermal: -1068.981987 hartree
zpe.sumelectthermalent: -1068.981043 hartree
zpe.sumelectthermalfe: -1069.053054 hartree
dipole: -3.8899 4.6347 0.6945
dipole: 6.0905
quadrupole: -97.3618 -129.4303 -124.8316
quadrupole: 7.0433 11.6801 0.4270
quadrupole: 19.8461 -12.2224 -7.6237 7.0433 11.6801 0.4270
hfenergy: -1069.292591 hartree
pointgroup: C01 [X(C16H16O6)]
dipole: 1.6053454 1.6714008 -0.6090736 debye
polarizability: 287.3740063|-8.128908|181.5973079|6.7067484|-30.1325289|128.0697841 unknown
InChI: InChI=1S/C16H16O6/c1-21-15-7-10-12(19)5-9(17)6-14(10)22-16(15)8-2-3-11(18)13(20)4-8/h2-6,15-20H,7H2,1H3
charge 0 multiplicity 1
38 atoms
O  0.57362 -0.979683 0.022897
O  -0.698585 2.480975 -0.528479
O  4.482264 1.897323 -0.264951
O  4.888897 -2.954933 0.547078
O  -5.242633 0.321637 -1.357094
O  -5.731973 -1.066091 0.908112
C  0.197925 1.476178 0.054409
C  -0.28159 0.111606 -0.513036
C  1.664735 1.745646 -0.342495
C  2.531164 0.517269 -0.137465
C  1.962137 -0.770274 0.038031
C  -1.71185 -0.233674 -0.144695
C  3.941375 0.606362 -0.086396
C  2.747301 -1.920511 0.268835
C  -2.7711 0.206898 -0.976497
C  -2.011667 -0.954512 1.036166
C  4.76505 -0.520148 0.137799
C  4.145514 -1.78217 0.318818
C  -0.657802 3.771053 0.161477
C  -4.099396 -0.068768 -0.615358
C  -3.350428 -1.236079 1.39062
C  -4.402065 -0.792943 0.567921
H  0.083498 1.45301 1.161186
H  -0.157878 0.142301 -1.615673
H  2.083419 2.590261 0.233323
H  1.675577 2.058322 -1.406233
H  2.277517 -2.897124 0.399011
H  -2.549158 0.786753 -1.880855
H  -1.192537 -1.320336 1.661042
H  5.858519 -0.41961 0.168832
H  0.32382 4.274371 0.047056
H  -0.882772 3.653573 1.242028
H  -1.438093 4.389989 -0.30893
H  -3.594627 -1.801022 2.294981
H  5.467864 1.878565 -0.186928
H  5.858568 -2.76136 0.560162
H  -4.997048 0.830169 -2.166084
H  -6.322665 -0.680523 0.208387
