program: Gaussian 16
title: Step 5 - PBEPBE-GD3MBJ modDZ (TS re-opt)
version: ES64L-G16RevC.01
method: RPBEPBE
basis: Gen
operation: Freq
keyword: #P#
keyword: PBEPBE/CHKBASIS
keyword: #
keyword: GEOM=CHECK
keyword: GUESS=READ
keyword: NOSYMM
keyword: INT=ULTRAFINE#
keyword: EMPIRICALDISPERSION=GD3BJ
keyword: IOP(3/174=1000000,3/175=358940,3/177=12092,3/178=5938951)
keyword: CPHF=(GRID=FINEGRID)
keyword: SCF=(VSHIFT=300,NOSYM,MAXCYCLE=250,CONVER=9)
keyword: FREQ
title: #P # PBEPBE/CHKBASIS # GEOM=CHECK # GUESS=READ # NOSYMM # INT=ULTRAFIN
converged: YES YES YES YES
title: Mulliken charges:
elementType: Ru C H C C Cl Cl H H H H H C N N C C C C H C H C C C H H H H H H H H H C C C H H H H H H H H H C C C C H H H C H C C H H H H C H H H C C C C C H H H C H C C H H H H C H H H
charge: -0.401257 0.116291 0.099844 -0.079298 -0.035140 -0.310552 -0.321503 0.110930 0.110169 0.115091 0.095603 0.085246 0.112258 -0.203187 -0.192265 0.084494 0.010101 0.080391 -0.328705 0.009037 -0.326239 0.005625 0.014938 0.027071 0.037163 0.024816 0.022495 0.055957 0.019452 0.020196 0.059675 0.026441 0.025370 0.024953 0.015311 0.033506 0.036703 0.023019 0.051606 0.022797 0.018100 0.022406 0.056310 0.025173 0.026865 0.025431 -0.098856 -0.006764 0.023999 -0.001243 0.044452 0.029989 0.109108 -0.047227 -0.056119 0.011209 -0.023680 0.058255 0.028118 0.049486 -0.058015 -0.003011 0.029544 0.050293 0.083015 -0.049419 -0.087809 0.011330 0.015402 -0.015192 0.035808 0.125282 0.039293 -0.041138 -0.052927 0.010622 -0.012720 0.062193 0.029082 0.049368 -0.055725 0.000684 0.050975 0.080031 0.029624
chargesum: -0.00000
title: Mulliken charges with hydrogens summed into heavy atoms:
elementType: Ru C C C Cl Cl C N N C C C C C C C C C C C C C C C C C C C C C C C C C C C C
charge: -0.401257 0.327065 0.131396 0.160275 -0.310552 -0.321503 0.112258 -0.203187 -0.192265 0.093531 0.010101 0.086015 -0.328705 -0.326239 0.118207 0.126393 0.113927 0.112732 0.130321 0.114172 -0.098856 -0.006764 0.207547 -0.057362 -0.047227 0.147068 -0.081695 0.159840 -0.049419 -0.087809 0.011330 0.215784 -0.068119 -0.041138 0.151265 -0.068445 0.161314
chargesum: 0.00000
polarizability: 5.24527527e+02 -2.39888218e+00 3.92343672e+02 8.31017795e+00 -1.32712480e+00 4.25550040e+02
1716.lowfreq: -94.6815 -5.8048 -0.0017 -0.0012 0.0008 2.8131 4.5079 19.2659 30.5258
frequency: -94.6782 19.2185 30.5246 32.5783 39.9532 50.3668 52.6756 63.1222 67.4051 91.2319 96.3103 98.5202 103.9790 108.9973 116.5310 123.5540 126.2963 131.1724 141.6180 149.7399 161.6447 164.3175 168.6435 179.5810 182.8613 186.1033 192.8148 193.1741 207.1336 207.7475 212.4347 218.4895 223.0090 229.8102 234.9508 238.2380 242.6164 248.4820 254.0514 254.8852 262.6925 267.5949 271.8293 279.2138 279.9483 285.3111 301.1587 301.9882 307.7643 310.4183 312.1677 329.8274 336.8428 356.8906 370.4415 374.0811 381.7454 385.6544 391.6176 396.8920 401.6633 414.6851 417.9712 449.6615 465.3465 481.4561 499.6500 501.2760 512.0318 513.0531 522.6308 539.5031 552.5277 566.9544 567.6064 574.8249 579.6517 581.6106 595.9409 605.2329 614.0642 643.1326 721.0591 740.3943 744.7036 784.1872 786.3615 786.5971 804.5623 815.6523 836.8290 837.9992 865.6829 866.0719 881.7394 893.8904 896.7191 901.8804 912.4021 914.5741 915.2275 916.5538 918.1322 919.7151 923.4735 926.3905 926.5092 937.7081 946.9888 955.4696 969.8465 985.8638 988.0937 991.3337 995.7449 997.0052 997.4369 1002.7874 1003.5757 1006.2241 1006.4136 1007.4292 1009.5007 1010.6508 1013.8935 1015.6397 1020.8633 1021.8138 1039.6744 1058.8802 1144.0805 1152.2728 1157.5226 1165.0112 1179.1362 1187.1157 1192.6956 1195.2020 1205.4091 1210.4393 1219.1955 1220.0526 1226.0967 1239.4866 1253.6953 1259.5464 1275.9947 1293.5015 1299.4932 1303.2711 1312.2123 1326.5943 1329.7201 1331.0581 1333.3283 1333.5626 1335.4920 1342.7200 1343.7126 1347.7030 1348.8917 1354.6839 1355.5207 1363.3132 1366.3158 1370.0972 1382.1784 1383.3992 1384.2920 1384.9552 1391.1257 1391.8971 1398.2967 1400.7163 1402.4154 1404.3547 1404.6746 1405.1280 1407.3375 1409.5375 1411.8271 1413.9638 1417.6153 1419.4324 1423.5784 1425.3876 1427.1112 1430.7373 1435.2461 1439.3966 1443.4574 1444.3741 1452.5052 1457.0165 1464.8656 1469.1701 1509.7975 1583.7314 1587.9832 1615.2827 1617.0783 2935.4550 2959.2207 2964.0976 2964.5076 2967.9187 2969.6710 2970.3589 2970.9599 2971.6566 2973.7532 2974.8061 2977.1874 2982.7098 2986.1570 2987.1870 3032.6040 3037.4877 3038.9167 3040.6225 3041.1369 3042.5008 3042.6627 3048.3900 3048.9813 3051.2906 3055.3354 3056.0994 3056.7396 3058.5547 3067.4192 3068.5302 3069.5353 3070.7320 3071.1318 3075.2365 3078.7415 3090.5908 3093.6969 3094.9401 3095.2934 3096.7406 3100.0380 3109.1635 3109.5597 3112.1489 3116.2604 3149.5171 3180.1330
redmass: 2.5220 5.1228 1.7422 1.8123 2.9331 1.3383 2.7200 3.3034 6.7258 3.5155 3.7195 3.3415 2.9466 3.6484 4.0257 3.9014 3.7827 4.6263 3.1743 3.2330 2.1989 3.0483 4.1557 1.7167 2.9421 1.5382 1.8927 1.7927 2.7371 1.9861 2.1163 3.6500 1.3231 1.6603 2.2954 1.8828 1.8504 2.0121 2.3432 3.0213 2.2336 2.1306 1.9787 2.3510 6.3736 1.5121 2.8674 7.5127 4.7922 2.5492 1.3698 2.1640 3.1242 4.2718 3.1091 1.3035 2.7389 2.3325 2.3651 1.7078 1.2104 2.2303 3.3445 3.6567 3.0182 2.7185 3.2841 3.2844 3.0736 3.2018 3.6229 2.9114 4.0572 4.2264 3.6740 4.0350 4.0589 1.3200 3.3126 3.5502 3.7488 4.8190 4.3930 4.4026 4.8951 2.9638 1.0691 1.1678 3.6454 3.3583 1.2688 1.2741 1.3015 1.3007 2.5077 2.7941 1.2730 2.3654 1.3174 1.4288 1.3650 1.3865 1.4367 1.5984 1.4840 1.9103 1.9004 1.1603 2.2292 2.4182 1.1887 4.4628 1.6711 1.6852 1.5828 1.4673 1.5414 1.7711 1.7745 1.5601 1.5699 1.6012 1.6492 1.6189 1.7652 1.7772 1.9203 2.0168 3.3802 2.5042 2.0597 1.6269 1.4359 1.4560 2.0324 1.9878 2.1959 2.4003 2.7844 2.6739 1.3506 1.3372 1.9576 1.9603 3.1885 1.6919 1.5307 1.2573 2.2773 2.2985 1.4621 1.2728 1.3019 1.2996 1.2949 1.2666 1.2971 1.4504 1.4311 3.2031 3.3682 1.5224 1.5196 1.2728 1.2500 2.7187 1.2425 1.3689 1.3935 1.1826 1.0927 1.3043 1.0866 1.0757 1.0835 1.0497 1.0518 1.0689 1.1398 1.0701 1.0847 1.1204 1.1337 1.1175 1.0889 1.0701 1.0903 1.1243 1.1688 1.2348 1.7699 1.8046 1.1225 3.4860 2.2604 2.7951 2.1263 7.8839 7.9522 6.5812 6.5804 1.0448 1.0460 1.0410 1.0401 1.0454 1.0379 1.0380 1.0402 1.0437 1.0526 1.0525 1.0487 1.0808 1.0413 1.0437 1.0603 1.0995 1.0993 1.1011 1.1012 1.0964 1.0954 1.1011 1.0898 1.0996 1.0995 1.0916 1.0987 1.1199 1.1013 1.1015 1.1025 1.0580 1.1000 1.1018 1.1007 1.1005 1.0901 1.0901 1.0998 1.0904 1.0907 1.0977 1.0951 1.0973 1.0938 1.1127 1.1168
irintensity: 2.0908 0.2542 0.2521 0.3179 0.0946 0.3967 0.0930 0.2921 1.8163 1.1450 0.4637 1.1978 0.9082 0.3140 0.2664 2.0473 0.1830 1.3314 0.6830 0.6685 0.2707 1.3053 0.4864 0.3339 2.7620 1.7879 2.0240 4.4074 1.2382 3.8518 2.5277 0.4391 0.6845 0.8833 0.7715 3.3063 0.6962 4.2549 3.7353 3.4100 1.5120 1.3169 0.6028 0.3188 0.0526 1.0203 4.6414 24.0113 15.0890 4.7956 0.3835 0.0237 1.0288 1.9338 0.0935 0.7557 4.0306 1.0260 1.9917 1.3666 0.1862 0.0305 0.4163 0.6054 3.0182 0.2349 0.1205 0.1460 1.6612 0.3871 0.5028 0.5844 0.9155 3.0130 2.8300 3.4713 0.0934 0.4589 2.9847 4.8368 8.7995 2.7598 0.2837 1.5506 6.0969 0.2060 1.5277 0.5025 6.1043 11.8684 4.6786 6.0957 0.2135 0.3651 2.4733 11.3996 2.8926 4.5418 0.5722 3.9464 0.4269 1.3602 2.0967 3.6097 3.6129 5.7676 1.9775 0.5527 5.2692 0.8053 5.3585 14.9600 4.3484 1.8419 6.7884 0.4344 5.9691 1.7823 11.3769 2.1548 0.8062 8.4860 5.0904 3.2503 5.7204 1.3265 3.8016 0.3160 4.2952 1.1856 2.0896 0.9568 1.2631 0.4531 40.5534 18.0445 1.0998 21.6159 38.4100 0.6099 0.5172 0.2061 55.8140 25.3518 68.7447 2.7963 10.7244 10.3465 6.0496 7.8556 0.9387 3.3007 5.4265 2.7194 0.8845 0.4894 10.9635 4.3970 3.0489 3.5680 0.4874 4.3074 0.6683 17.5818 27.7691 25.8865 7.4618 5.3317 4.0735 2.4071 3.7477 12.4017 2.1794 0.3702 0.5325 5.1169 11.2132 1.1225 0.4475 12.6822 9.3327 3.8353 7.1855 9.2965 0.1620 11.8235 9.7246 1.2717 45.8183 13.6192 68.2976 0.7427 7.8335 292.5079 27.8528 31.4053 5.4145 2.2234 4.0319 20.0535 26.3468 22.5106 27.1417 59.0985 17.3764 36.7249 37.9814 27.7798 17.5093 2.0978 3.7083 9.7399 68.2662 14.5911 31.2666 27.7436 0.2718 9.6565 9.4920 11.3148 8.5365 7.6690 9.5735 61.4343 10.6048 2.4624 20.4274 12.1135 22.4628 10.0638 10.0551 9.8544 22.9159 3.2360 2.4478 35.0337 37.4682 1.5127 12.9708 16.7418 1.6528 13.5256 14.2728 1.3415 4.9371 4.9556 4.9261 2.4543 0.9045
temp: 298.150 k
press: 1.00000 atm
elementType: 44 6 1 6 6 17 17 1 1 1 1 1 6 7 7 6 6 6 6 1 6 1 6 6 6 1 1 1 1 1 1 1 1 1 6 6 6 1 1 1 1 1 1 1 1 1 6 6 6 6 1 1 1 6 1 6 6 1 1 1 1 6 1 1 1 6 6 6 6 6 1 1 1 6 1 6 6 1 1 1 1 6 1 1 1
symmnumber: 1
zpe: 1858637.2 jmol-1
zpe.correction: 0.707918 hartree
zpe.thermalcorrener: 0.751818 hartree
zpe.thermalcorrenthalpy: 0.752762 hartree
zpe.thermalcorrgfe: 0.634958 hartree
zpe.sumelectzpe: -2370.261639 hartree
zpe.sumelectthermal: -2370.217739 hartree
zpe.sumelectthermalent: -2370.216794 hartree
zpe.sumelectthermalfe: -2370.334598 hartree
dipole: 0.0363 0.1004 -4.0232
dipole: 4.0246
quadrupole: -233.9262 -264.5507 -253.5266
quadrupole: 5.5959 -0.0916 -0.3499
quadrupole: 16.7416 -13.8829 -2.8588 5.5959 -0.0916 -0.3499
hfenergy: -2370.9695562 hartree
pointgroup: C01 [X(C32H48Cl2N2Ru1)]
dipole: 0.0142936 0.0394904 -1.5828523 debye
polarizability: 524.5275274|-2.3988822|392.3436719|8.3101779|-1.3271248|425.5500401 unknown
InChI: InChI=1S/C29H42N2.C2H4.CH2.2ClH.Ru/c1-18-13-20(3)24(21(4)14-18)30-17-31(25-22(5)15-19(2)16-23(25)6)27(29(10,11)12)26(30)28(7,8)9;1-2;;;;/h13-16,26-27H,1-12H3;1-2H2;1H2;2*1H;/q;;;;;+2/p-2
charge 0 multiplicity 1
85 atoms
Ru 0.20560928 0.02225035 2.4668553
C  -1.36509866 -0.59673558 3.13548425
H  -1.46301362 -1.6571537 3.45490514
C  1.66854926 0.06463375 4.11969958
C  0.5574446 0.65047899 4.71334608
Cl -0.77315896 2.23779157 2.38052267
Cl 1.00969395 -2.26110721 2.34992538
H  -2.22458311 0.08545007 3.31196795
H  0.36384759 1.73054238 4.65531166
H  2.40753977 0.70266813 3.59988561
H  1.99196351 -0.95889433 4.35497154
H  -0.05949701 0.07202933 5.4176654
C  -0.06161639 0.00358036 0.45409672
N  -1.172137 -0.17525674 -0.30235825
N  1.0027277 0.27114041 -0.34569627
C  -0.88987794 -0.02782243 -1.77021159
C  -2.49574953 -0.23860441 0.27499564
C  0.63785831 0.32057301 -1.79663997
C  -1.34366651 -1.264793 -2.62583476
H  -1.46703948 0.84407406 -2.14110598
C  1.03904381 1.67452086 -2.48160293
H  1.19061663 -0.48570433 -2.32226435
C  0.36264762 2.87482449 -1.7989663
C  2.57555919 1.81319796 -2.45531122
C  0.63205474 1.69288818 -3.96559623
H  -0.70431247 2.94870884 -2.08498863
H  0.85036099 3.81796138 -2.11787143
H  0.41432776 2.81797917 -0.69845056
H  2.87879568 2.69816529 -3.05046331
H  3.06045819 0.92280387 -2.90709535
H  2.98674566 1.93269783 -1.43978122
H  1.12527197 0.88884307 -4.54670258
H  0.94641928 2.66074527 -4.40582527
H  -0.46164865 1.60961262 -4.10684207
C  -0.61888187 -2.5531799 -2.20692279
C  -2.87274274 -1.44545964 -2.5139887
C  -1.04665266 -1.02792441 -4.11746928
H  -1.12243399 -3.43248625 -2.65698879
H  -0.60925244 -2.68930683 -1.11241297
H  0.42915446 -2.56192512 -2.56275322
H  -3.21092086 -2.18108246 -3.27167705
H  -3.40506389 -0.49183315 -2.71039109
H  -3.19818838 -1.80743935 -1.52486761
H  0.03286256 -0.89968116 -4.3198107
H  -1.58711179 -0.14729025 -4.51730617
H  -1.38519418 -1.91424869 -4.69092191
C  -2.94969568 -1.43468811 0.89043874
C  -3.31920147 0.91498133 0.24817987
C  -2.16781548 -2.72251661 0.90308224
C  -4.23249619 -1.43682703 1.47413463
H  -2.34786877 -3.29694599 -0.02988946
H  -2.50507913 -3.36203312 1.74093393
H  -1.07833891 -2.57446671 1.02120243
C  -5.07237838 -0.31523979 1.45887895
H  -4.58045343 -2.3633835 1.95692323
C  -6.43420763 -0.34063984 2.1049606
C  -4.59392403 0.84739368 0.83290973
H  -6.475789 0.34910889 2.97387525
H  -6.69592954 -1.35377676 2.46525189
H  -7.22313575 -0.01299489 1.39737243
H  -5.22361331 1.75068045 0.81458837
C  -2.86842662 2.20932639 -0.37048782
H  -3.51776321 3.04059944 -0.03870262
H  -2.91699112 2.17653038 -1.48043882
H  -1.83348616 2.44726617 -0.06534819
C  2.34030093 0.19226354 0.21652247
C  2.89905909 1.27892612 0.94298551
C  3.06988144 -1.01946069 0.06754628
C  2.28734438 2.65210145 1.05097917
C  4.16342293 1.0932723 1.54444255
H  2.69541285 3.17710366 1.93571233
H  1.18817815 2.64293263 1.15794833
H  2.54884514 3.26377329 0.16178948
C  4.89377748 -0.09456129 1.42924729
H  4.59044176 1.93350927 2.11418441
C  6.2293793 -0.26969494 2.10429942
C  4.32939527 -1.13281252 0.66894283
H  6.16412996 -1.02220708 2.91801906
H  6.59063887 0.67744877 2.54822003
H  6.99785083 -0.63300332 1.39195579
H  4.87399796 -2.08353422 0.56179274
C  2.51845147 -2.19235914 -0.69115335
H  2.51770048 -2.0131896 -1.78720691
H  1.48528375 -2.41114519 -0.3676412
H  3.12819146 -3.09466969 -0.50186601
